{"text_format":"1","workbook":"xlsx","n_sheets":20,"sheets":["NEWS","INDEX","Drawing","Cable Parameters","filter","APPLICATION","Input","Insertion Loss","גיליון1","HOME","Drawing table","SMP","716","BMA","N","SMA","TNC","Support Sheet","Connector Types","History"],"not_rendered":{"charts":2,"images":146,"macros":1,"external_links":1,"defined_names":46,"comments":2,"pivot_tables":0},"unopened":[],"bounds":{"document_bytes":16777216,"sheet_cells":100000,"rows_first":2000,"rows_last":500,"rows_between":2000,"halvings":0,"cell_chars":16384,"cell_head_chars":4096},"cells_cut":0,"cells_raw":0,"read":"whole","date_system":"1900"}

{"sheet":"NEWS","index":0,"n_rows":6,"n_cols":8,"rows_kept":6,"cut":false,"hidden":false,"merged":[]}
["Picture 11",null,null,null,null,null,{"$f":"COUNTA(A1:A16)","v":6},"counter"]
["Picture 15",null,null,null,null,null,"/"]
["Picture 9",null,null,null,null,null,{"$f":"'Insertion Loss'!R1-1","v":-1},"now"]
["Picture 8",null,null,null,null,null,{"$f":"CONCATENATE(G5,G3,G2,G1)","v":"January 2019  -1/6"}]
["Picture 2",null,null,null,null,null,"January 2019  ","חודש"]
["Picture 3"]

{"sheet":"INDEX","index":1,"n_rows":28,"n_cols":3,"rows_kept":28,"cut":false,"hidden":true,"merged":[]}
["Conn. Name","Right","Left"]
["SP TNC","Picture 2","Picture 1"]
["RP TNC","Picture 4","Picture 3"]
["SJ TNC","Picture 6","Picture 5"]
["BJ TNC","Picture 8","Picture 7"]
["FJ TNC","Picture 10","Picture 9"]
["SP SMA","Picture 12","Picture 11"]
["RP SMA","Picture 14","Picture 13"]
["SJ SMA","Picture 16","Picture 15"]
["BJ SMA","Picture 18","Picture 17"]
["FJ SMA","Picture 21","Picture 20"]
["FJ BMA","Picture 24","Picture 23"]
["BJ BMA","Picture 26","Picture 25"]
["FJ BMA","Picture 28","Picture 27"]
["SJ BMA","Picture 30","Picture 29"]
["FJ BMA","Picture 34","Picture 31"]
["SP N","Picture 36","Picture 35"]
["RP N","Picture 38","Picture 37"]
["SJ N","Picture 40","Picture 39"]
["BJ N","Picture 42","Picture 41"]
["FJ N","Picture 44","Picture 43"]
["SP 7/16","Picture 50","Picture 45"]
["RP 7/16","Picture 52","Picture 51"]
["SJ 7/16","Picture 54","Picture 53"]
["BJ 7/16","Picture 56","Picture 55"]
["FJ 7/16","Picture 58","Picture 57"]
["SP SMP","Picture 60","Picture 59"]
["RP SMP","Picture 48","Picture 47"]

{"sheet":"Drawing","index":2,"n_rows":42,"n_cols":32,"rows_kept":42,"cut":false,"hidden":false,"merged":[[25,12,25,13],[25,10,25,11],[40,5,40,20],[41,6,41,20],[32,8,32,11],[30,8,30,11],[27,6,32,7],[32,12,32,13],[39,5,39,15],[26,12,26,13],[31,8,31,11],[27,10,27,11],[28,10,28,11],[29,10,29,11],[30,12,30,13],[33,27,33,31],[37,5,37,15],[33,5,33,15],[7,6,7,7],[6,9,6,11],[6,13,6,14],[24,6,24,8],[20,13,20,14],[20,11,20,12],[24,9,24,10],[22,11,22,12],[23,13,23,14],[22,13,22,14],[23,6,23,8],[6,6,6,7],[25,6,26,7],[15,1,19,3],[24,13,24,14],[23,9,23,10],[10,29,10,30],[11,29,11,30],[12,29,12,30],[19,29,19,30],[16,9,17,11],[11,9,11,11],[12,17,12,20],[20,6,20,8],[22,9,22,10],[18,13,19,14],[18,8,19,12],[22,6,22,8],[20,2,20,3],[4,28,4,30],[5,29,5,30],[6,29,6,30],[25,28,25,30],[8,28,8,30],[20,29,20,30],[21,29,21,30],[22,29,22,30],[23,29,23,30],[9,29,9,30],[13,29,13,30],[14,29,14,30],[17,29,17,30],[18,29,18,30],[16,28,16,30],[28,2,28,3],[26,2,26,3],[24,2,24,3],[25,2,25,3],[27,2,27,3],[36,2,36,3],[29,2,29,3],[30,2,30,3],[32,2,32,3],[33,2,33,3],[34,2,34,3],[35,2,35,3],[21,0,32,0],[26,8,26,9],[21,4,32,4],[21,6,21,10],[29,27,29,31],[27,29,27,30],[26,29,26,30],[26,10,26,11],[32,27,32,28],[30,27,30,28],[29,12,29,13],[31,12,31,13],[20,26,23,27],[21,2,21,3],[22,2,22,3],[23,2,23,3]]}
[null,null,null,null,null,null,null,null,null,null,null,null,null,null,null,null,null,"מונה שליחותS1",27,"right",0,"r6",null,null,null,null,null,null,0]
[null,null,null,null,null,null,null,null,null,null,null,null,null,null,null,null,null,"תיבת בחירה:",null,"left",0,"r7"]
[null,null,null,null,null,null,null,null,null,null,null,null,null,null,null,null,null,{"$f":"ISBLANK(R6)","v":true},null,{"$f":"AND(R3=FALSE,R4=FALSE)","v":false},{"$f":"OR(U1=1,U2=1)","v":false}]
[null,null,null,null,null,null,null,null,null,null,"fwsdfdsf",null,null,null,null,null,null,{"$f":"ISBLANK(R7)","v":true}]
[null,null,null,null,null,null,null,null,null,null,3,null,null,null,null,null,null,null,"Cable",null,"Picture 19",null,null,null,null,null,null,null,"Cable Name"]
[null,null,null,null,null,null,null,null,null,null,null,null,null,null,null,null,null,null,"Conn. Right",{"$f":"RIGHT(R6,LEN(R6)-3)","v":{"$error":"#VALUE!"}},{"$f":"IF(ISERROR(VLOOKUP(R6,INDEX!A:F,2,FALSE)),\"\",VLOOKUP(R6,INDEX!A:F,2,FALSE))","v":""},null,null,null,null,null,null,null,"Code N","Description"]
[null,null,null,null,null,null,"Lable 1",null,null,"Lable 2",null,null,null,"Lable 3",null,null,null,null,"Conn. Left",{"$f":"RIGHT(R7,LEN(R7)-3)","v":{"$error":"#VALUE!"}},{"$f":"IF(ISERROR(VLOOKUP(R7,INDEX!A:F,3,FALSE)),\"\",VLOOKUP(R7,INDEX!A:F,3,FALSE))","v":""},null,null,null,null,null,null,null,"Name","Cable Name"]
[null,null,null,null,null,null,null,null,null,null,null,null,null,null,null,null,null,"No","Boot",null,{"$f":"\"Picture \"&VLOOKUP(R8,'Drawing table'!A:F,2,FALSE)","v":{"$error":"#N/A"}}]
[null,null,null,null,null,null,null,null,null,null,null,null,null,null,null,null,null,"No","Marking Sleeve",null,{"$f":"\"picture\" & VLOOKUP(R9,'Drawing table'!A:F,2,FALSE)","v":{"$error":"#N/A"}},null,null,null,null,null,null,null,"Connector Shape"]
[null,null,6,null,null,null,null,null,null,null,null,null,null,null,null,null,null,{"$f":"IF(R9=\"Yes\",\"Yes\",\"No\")","v":"No"},"Clear Sleeve",null,{"$f":"CONCATENATE(T24,\"-\",U26,T26,\"-\",U25,T25,\"-\",S24,)","v":"EZ_118_TP-XXX-XXX-1000 mm"},"Drawing No.",null,null,null,null,null,null,"Code YY","Description"]
[null,null,null,null,null,null,null,null,null,null,null,null,null,null,null,null,null,{"$f":"Length","v":1000},"Length",null,{"$f":"CONCATENATE(L21,\" - \" )","v":" - "},{"$f":"TEXT(TODAY(), \"dd/mm/yy\")","v":"13/06/19"},null,{"$f":"DAY(V11)","v":13},null,null,null,null,"SP","Straight Plug"]
[null,null,null,null,null,null,null,null,null,null,null,null,null,null,null,null,null,"BMA","Last Sheet",null,null,{"$f":"TEXT(NOW(), \"H:MM AM/PM\")","v":"10:02 AM"},null,{"$f":"MONTH(V11)","v":6},null,null,null,null,"RP","Right angle Plug"]
[null,null,null,null,null,null,null,null,null,null,null,null,null,null,null,null,null,"last Picture Light",null,null,null,{"$f":"CONCATENATE(CONCATENATE(V11,\"  \",V12))","v":"13/06/19  10:02 AM"},null,{"$f":"YEAR(V11)","v":2019},null,null,null,null,"SJ","Straight Jack"]
[null,null,null,null,null,null,null,null,null,null,null,null,null,null,null,null,null,null,"right",null,"left",null,null,{"$f":"X11&\"_\"&X12&\"_\"&X13","v":"13_6_2019"},null,null,null,null,"BJ","Bulkhead Jack"]
[null,null,null,null,null,null,null,null,null,null,null,null,null,null,null,null,null,"BMA","sheet","BMA","sheet",null,null,null,null,null,null,null,"FJ","Flange Jack"]
[null,null,null,null,null,null,null,null,null,null,null,null,null,null,null,null,null,"H11","H","M11","M"]
[null,null,null,null,null,null,null,null,null,{"$f":"\"Cable Length: \" & R11 & \" mm\"","v":"Cable Length: 1000 mm"},null,null,null,null,null,null,null,"G13","G","O13","O",null,null,null,null,null,null,null,"Connector Family"]
[null,null,null,null,null,null,null,null,null,null,null,null,null,null,null,null,null,null,null,null,null,null,null,null,null,null,null,null,"Code C","Description"]
[null,null,null,null,null,null,null,null,{"$f":"U10","v":"EZ_118_TP-XXX-XXX-1000 mm"},null,null,null,null,"Drawing No.",null,null,null,null,null,null,null,null,null,null,null,null,null,null,"S","SMA"]
[null,null,null,null,null,null,null,null,null,null,null,null,null,null,null,null,null,null,null,null,null,null,null,null,null,null,null,null,"T","TNC"]
[null,null,null,null,null,null,null,null,null,null,null,null,null,null,null,null,null,{"$f":"IF(S21=\"\",\"\",IF(S21=\"P\",\"/ Plug\",\"/ Jack\"))","v":""},{"$f":"RIGHT(LEFT(R6,2),1)","v":""},"right","סיומת הקונקטור",null,null,null,null,null,null,null,"N","N TYPE"]
[null,null,null,null,null,null,"Contact Information",null,null,null,null,null,null,null,null,null,null,{"$f":"IF(S22=\"\",\"\",IF(S22=\"P\",\"/ Plug\",\"/ Jack\"))","v":""},{"$f":"RIGHT(LEFT(R7,2),1)","v":""},"left",null,null,null,null,null,null,null,null,"B","BMA"]
[null,null,null,null,null,null,null,null,null,"Name",null,{"$f":"T24","v":"EZ_118_TP"},null,"Cable Type",null,null,null,"lable color",null,"בונה את מקט הקונקטור",null,null,null,null,null,null,null,null,"P","SMP"]
[null,null,null,null,null,null,"",null,null,"Phone",null,null,{"$f":"'Insertion Loss'!D19","v":"None"},"Conn.Left   Shape",null,null,null,1,{"$f":"Length & \" mm\"","v":"1000 mm"},"EZ_118_TP","שם הכבל",null,null,null,null,null,null,null,"7/16",7.16]
[null,null,null,null,null,null,null,null,null,"Company",null,null,{"$f":"'Insertion Loss'!D18","v":"None"},"Conn.Right Shape",null,null,null,null,null,{"$f":"IF(ISERROR(IF(T6=\"7/16\",\"7/16\",IF(T6=\"SMP\",\"P\",LEFT(T6,1)))),\"X\",IF(T6=\"7/16\",\"7/16\",IF(T6=\"SMP\",\"P\",LEFT(T6,1))))","v":"X"},{"$f":"IF(LEFT(R6,2)=\"\",\"XX\",LEFT(R6,2))","v":"XX"},"right"]
[null,null,null,null,null,null,"Click here to visit our website",null,"units","QTY","Manufacturer P/N",null,"Description",null,"#",null,null,1000,"cable length save",{"$f":"IF(ISERROR(IF(T7=\"7/16\",\"7/16\",IF(T7=\"SMP\",\"P\",LEFT(T7,1)))),\"X\",IF(T7=\"7/16\",\"7/16\",IF(T7=\"SMP\",\"P\",LEFT(T7,1))))","v":"X"},{"$f":"IF(LEFT(R7,2)=\"\",\"XX\",LEFT(R7,2))","v":"XX"},"left",null,null,null,null,null,null,"Cable Length"]
[null,null,null,null,null,null,null,null,{"$f":"S24","v":"1000 mm"},null,{"$f":"L23","v":"EZ_118_TP"},null,"Cable / Wire",null,null,null,null,0,"mode",null,null,null,null,null,null,null,null,null,"Code L","Description"]
[null,null,null,null,null,null,null,null,{"$f":"IF(J28>0,\"Pc\",\"\")","v":""},{"$f":"IF(ISBLANK(R7),0,1)","v":0},null,null,{"$f":"R22","v":""},{"$f":"IF(R7=\"\",\"\",R7)","v":""},null,null,null,null,null,null,null,null,null,null,null,null,null,null,"Lenght","Cable Length"]
[null,null,null,null,null,null,null,null,"",{"$f":"IF(ISBLANK(R6),0,1)","v":0},null,null,{"$f":"R21","v":""},{"$f":"IF(R6=\"\",\"\",R6)","v":""},null,null,null,null,null,null,{"$f":"U10","v":"EZ_118_TP-XXX-XXX-1000 mm"}]
[null,null,null,null,null,null,null,null,"Pc",2,null,null,"BOOT",null,4,null,null,null,null,"save",null,null,null,null,null,null,null,"Drawing No."]
[null,null,null,null,null,null,null,null,null,null,null,null,"VSWR",null,5,null,null,null,null,null,{"$f":"\"EIM First_\"&G20&\"_\" & X14 & \"_\"& T35","v":"EIM First__13_6_2019_10_2AM"},null,null,null,null,null,null,"Length",null,"R. Conn.","L. Conn.","Cable"]
[null,null,null,null,null,null,null,null,null,null,null,null,"Phase Match",null,6]
[null,null,null,null,null,null,null,null,null,null,null,null,"IL & VSWR TESTS",null,7,null,null,null,null,{"$f":"HOUR(NOW())","v":10},null,null,null,null,null,null,null,"LENGTH",null,"YYC","YYC","Name"]
[null,null,null,null,null,"*The connectors drawing in this illustration are not necessarily availible. They are for initial evaluation only.",null,null,null,null,null,null,null,null,null,null,null,null,"_",{"$f":"MINUTE(NOW())","v":2},null,null,null,null,null,null,null,"Name-YYC-YYC-Length mm"]
[null,null,null,null,null,null,null,null,null,null,null,null,null,null,null,"Note:",null,null,{"$f":"IF(T33>12,\"PM\",\"AM\")","v":"AM"},{"$f":"T33&S34&T34&S35","v":"10_2AM"}]
[]
[]
[null,null,null,null,null,{"$f":"V13","v":"13/06/19  10:02 AM"},null,null,null,null,null,null,null,null,null,null,null,null,null,"SJ"]
[null,null,null,null,null,null,null,null,null,null,null,null,null,null,null,null,null,null,null,"RP"]
[null,null,null,null,null,null,null,null,null,null,null,null,null,null,null,null,null,null,null,{"$f":"LEFT(T39,1)","v":"R"}]
[null,null,null,null,null,"Please E-mail this PDF file to the EIM First's Sales Manager to illustrate the request. "]
[null,null,null,null,null,null," rachel@eimsys.co.il"]

{"sheet":"Cable Parameters","index":3,"n_rows":220,"n_cols":151,"rows_kept":220,"cut":false,"hidden":true,"merged":[[3,137,3,139],[1,130,1,134],[2,86,2,114],[1,69,1,72],[1,6,1,7],[3,44,3,48],[3,54,3,55],[3,49,3,53],[3,29,3,33],[3,34,3,38],[3,39,3,43],[1,24,1,26]]}
["Coaxial Cable Parameters",null,null,null,25,"טמפ' לחישוב עמודת ניחות",null,null,null,null,"נתוני כבלים","smallest","מחשב מספר תוין שנקלטו",null,null,"תדר נבחר","In/Outdoor","הספק נבחר","עובי נבחר",null,{"$f":"COLUMN()","v":21},null,null,null,null,null,null,null,"Coaxial Cable Parameters",null,null,null,null,null,null,null,null,null,null,null,null,null,null,null,null,null,null,null,null,null,null,null,null,null,null,null,null,null,null,null,null,null,null,null,null,null,null,null,null,null,null,null,null,null,null,null,null,null,0.01,1.3559999999999999E-2,0.03,0.05,0.1,0.15,0.4,0.45,0.5,0.9,1,1.5,1.8,2,2.5,3,4,5,5.8,6,8,10,11,12,13.5,15,16,18,24,26.5,28,35,40,50,63,65,90,null,null,null,null,null,null,null,null,"bend radius"]
["Cable Type","coefficient A","coefficient B","CW POWER HANDLING","ניחות בתדר מקסימאלי","max Frequency","Temperature",null,"Temp. coeff.","Source","thickness","מספר אינדקס","מקבל ערך לחיפוש Filter מ P12",null,"מחזיר מילה שמקיימת את הקלט-מספר שורה",null,null,"N/A",null,"SMALL","CABLE NAME","FREQ","THIK.",null,null,null,null,null,"Cable Type",{"$f":"COLUMN()","v":30},{"$f":"COLUMN()","v":31},{"$f":"COLUMN()","v":32},{"$f":"COLUMN()","v":33},{"$f":"COLUMN()","v":34},{"$f":"COLUMN()","v":35},{"$f":"COLUMN()","v":36},{"$f":"COLUMN()","v":37},{"$f":"COLUMN()","v":38},{"$f":"COLUMN()","v":39},{"$f":"COLUMN()","v":40},{"$f":"COLUMN()","v":41},{"$f":"COLUMN()","v":42},{"$f":"COLUMN()","v":43},{"$f":"COLUMN()","v":44},{"$f":"COLUMN()","v":45},{"$f":"COLUMN()","v":46},{"$f":"COLUMN()","v":47},{"$f":"COLUMN()","v":48},{"$f":"COLUMN()","v":49},{"$f":"COLUMN()","v":50},{"$f":"COLUMN()","v":51},{"$f":"COLUMN()","v":52},null,null,null,null,null,{"$f":"COLUMN()","v":58},null,null,null,61,null,null,null,{"$f":"COLUMN()","v":66},{"$f":"COLUMN()","v":67},{"$f":"COLUMN()","v":68},{"$f":"COLUMN()","v":69},"connectoe list",null,null,null,"משפחות קונקטורים",null,null,null,null,{"$f":"COLUMN()","v":79},{"$f":"COLUMN()","v":80},{"$f":"COLUMN()","v":81},{"$f":"COLUMN()","v":82},{"$f":"COLUMN()","v":83},{"$f":"COLUMN()","v":84},{"$f":"COLUMN()","v":85},{"$f":"COLUMN()","v":86},{"$f":"COLUMN()","v":87},{"$f":"COLUMN()","v":88},{"$f":"COLUMN()","v":89},{"$f":"COLUMN()","v":90},{"$f":"COLUMN()","v":91},{"$f":"COLUMN()","v":92},{"$f":"COLUMN()","v":93},{"$f":"COLUMN()","v":94},{"$f":"COLUMN()","v":95},{"$f":"COLUMN()","v":96},{"$f":"COLUMN()","v":97},{"$f":"COLUMN()","v":98},{"$f":"COLUMN()","v":99},{"$f":"COLUMN()","v":100},{"$f":"COLUMN()","v":101},{"$f":"COLUMN()","v":102},{"$f":"COLUMN()","v":103},{"$f":"COLUMN()","v":104},{"$f":"COLUMN()","v":105},{"$f":"COLUMN()","v":106},{"$f":"COLUMN()","v":107},{"$f":"COLUMN()","v":108},{"$f":"COLUMN()","v":109},{"$f":"COLUMN()","v":110},{"$f":"COLUMN()","v":111},{"$f":"COLUMN()","v":112},{"$f":"COLUMN()","v":113},{"$f":"COLUMN()","v":114},{"$f":"COLUMN()","v":115},null,null,null,null,null,null,null,null,{"$f":"COLUMN()","v":124},"Cable Type","INDOOR","OUTDOOR","\"\"",null,null,"סינון סופי לפי ניחות ועמודות לגיליון FILTER",null,null,null,null,null,{"$f":"COLUMN()","v":137},{"$f":"COLUMN()","v":138},{"$f":"COLUMN()","v":139},{"$f":"COLUMN()","v":140},{"$f":"COLUMN()","v":141},{"$f":"COLUMN()","v":142},{"$f":"COLUMN()","v":143},{"$f":"COLUMN()","v":144},{"$f":"COLUMN()","v":145},{"$f":"COLUMN()","v":146},{"$f":"COLUMN()","v":147},{"$f":"COLUMN()","v":148},{"$f":"COLUMN()","v":149},"FILTER appliction column","app name"]
[null,"nominal","nominal",{"$f":"P2","v":0},{"$f":"P2","v":0},"[GHz]","max [°C]","min [°C]","J [%/°C]",null,null,{"$f":"IF(filter!$K$26=\"\",\"\",filter!$K$26)","v":""},{"$f":"IF(L3=\"\",\"\",\"*\"&UPPER(L3))","v":""},{"$f":"LEFT(M3,1)","v":""},null,"מחזיר את מספר השורה המקיימת את התדר ומעלה","מחזיר את מספר השורה המקיימת את הבחירה","מחזיר את מספר השורה המקיימת את ההספק","מחזיר את מספר השורה המקיימת את העובי",null,null,null,null,null,null,{"$f":"Q2","v":0},null,null,null,null,null,null,null,null,null,null,null,null,null,null,null,null,null,null,null,null,null,null,null,null,null,null,null,null,null,null,null,null,null,"false= מאופשר","true=  לא מאופשר",null,null,null,null,null,null,"אינדקס מספר השורה",null,"מספר השורה של הכבל הנבחר","true= אין קונקטורים מתאימים false = יש קונקטור",null,null,null,null,null,null,null,null,null,null,null,null,null,null,null,"FREQ GHZ",null,null,null,null,null,null,null,null,null,null,null,null,null,null,null,null,null,null,null,null,null,null,null,null,null,null,null,null,null,null,null,null,null,null,null,null,"mm",null,{"$f":"COLUMN()","v":126},{"$f":"COLUMN()","v":127},128,null,null,"עמודה T",null,null,null,null,null,"input","avionics","space","naval","high temp","internal box","outdoor flexible","outdoor fixed","phase/ vs/ temp","test cables","high power","wireless","industrial"]
[null,null,null,null,null,null,null,null,null,null,null,null,{"$f":"LEN(M3)","v":0},{"$f":"RIGHT(M3,LEN(M3)-1)","v":{"$error":"#VALUE!"}},null,"מתוך עמודה O","עמודה IN/OUT","מתוך עמודה Q","מתוך עמודה R","מתקבל מעמודה EE לאחר סינון ניחות. חזרה לעמודה T לתצוגה",null,null,null,"ניחות","power","in/outdoor","Bend Radius",null,null,"TNC",null,null,null,null,"SMA",null,null,null,null,"N",null,null,null,null,"BMA",null,null,null,null,7.16,null,null,null,null,"SMP",null,null,"SPECHIAL CONN.",null,"TNC","SMA","N","BMA",716,"SMP",null,null,{"$f":"ROW()","v":4},"index",{"$f":"VLOOKUP('Insertion Loss'!C9,'Cable Parameters'!A:BQ,66,FALSE)","v":0},null,null,null,null,null,null,null,null,null,null,null,null,null,null,null,null,null,null,null,null,null,null,null,null,null,null,null,null,null,null,null,null,null,null,null,null,null,null,null,null,null,null,null,null,null,null,null,null,null,null,null,null,null,null,null,null,null,null,null,null,"מספרי השורהלאחר סננים","תוצאות הניחות ",null,null,"מספר השורה לאחר סינון ולאחר סינון לפי ניחות. מועבר לעמודה T",null,null,"מקבל ערך מעמודה A ועמודה אחרונה תהיה לאחר סינון",null,null,null,null,"מסנן אפליקציה ",null,null,null,null,null,null,"output list"]
["Customer Spec.",null,null,"N/A - in development",null,null,null,null,0.2,null,null,null,"כבלים לפי סנן APPLICTION",null,null,null,"1-in 2-oout",null,null,null,null,null,null,null,null,null,null,null,"Customer Spec.","SP","RP","SJ","SJ","SJ","SP","RP","SJ","SJ","SJ","SP","RP","SJ","SJ","SJ",13,14,15,24,25,11,16,21,24,25,"SMP","RP",null,{"$f":"VLOOKUP('Insertion Loss'!C9,'Cable Parameters'!A:WQ,58,FALSE)","v":1},null,null,null,null,null,null,null,null,null,{"$f":"ROW()","v":5},null,null,null,null,"smmalest",null,null,null,null,null,0.01,1.3559999999999999E-2,0.03,0.05,0.1,0.15,0.4,0.45,0.5,0.9,1,1.5,1.8,2,2.5,3,4,5,5.8,6,8,10,11,12,13.5,15,16,18,24,26.5,28,35,40,50,63,65,90,null,null,null,null,null,null,null,null,null,"Customer Spec."]
["EZ_118_TP",0.38040000000000002,1.6000000000000001E-4,"N/A",{"$f":"((B6*SQRT($E$3*1000)+C6*$E$3*1000))/30480*Length*(1+'Cable Parameters'!I6/100*('Cable Parameters'!$E$1-25))+('Insertion Loss'!$F$16+'Insertion Loss'!$F$17)*SQRT($E$3)","v":0},40,200,-55,0.2,"https://www.ezform.com/product/ez-118-tp/",3,1,{"$f":"ET6","v":"EZ_118_TP"},"ביטלתי את העמודה",{"$f":"IF(M6=\"\",\"\",     IF($M$4=0,ROW(), IF(ISERROR(FIND($N$4,UPPER(A6))),\"\",ROW())))","v":6},{"$f":"IF(O6=\"\",\"\",IF($P$2=\"\",O6,IF(OR(INDEX(A:M,ROW(),6)=$P$2,INDEX(A:M,ROW(),6)>$P$2),ROW(),\"\")))","v":6},{"$f":"IF(P6=\"\",\"\",IF($Q$2=\"\",P6,IF(INDEX(DV:DW,ROW(),$Q$2)=\"\",\"\",ROW())))","v":6},{"$f":"IF(Q6=\"\",\"\",IF($R$2=\"\",Q6,IF(OR(INDEX(A:WQ,ROW(),4)=$R$2,INDEX(A:WQ,ROW(),4)>$R$2),ROW(),\"\")))","v":6},{"$f":"IF(R6=\"\",\"\",IF($S$2=\"\",R6,IF(OR(INDEX(A:N,ROW(),11)>$S$2+1,INDEX(A:N,ROW(),11)<$S$2-1),\"\",ROW())))","v":6},{"$f":"EE6","v":6},{"$f":"IF(T6=\"\",\"\",INDEX(A:M,T6,1))","v":"EZ_118_TP"},{"$f":"IF(T6=\"\",\"\",INDEX(A:N,T6,6))","v":40},{"$f":"IF(T6=\"\",\"\",INDEX(A:O,T6,11))","v":3},{"$f":"IF(T6=\"\",\"\",INDEX(A:P,T6,5))","v":0},{"$f":"IF(T6=\"\",\"\",INDEX(A:R,T6,4))","v":"N/A"},{"$f":"IF(ISERROR(IF($Q$2=\"\",INDEX(A:WQ,T6,128),IF($Q$2=1,INDEX(A:WQ,T6,126),INDEX(A:WQ,T6,127)))),\"\",IF($Q$2=\"\",INDEX(A:WQ,T6,128),IF($Q$2=1,INDEX(A:WQ,T6,126),INDEX(A:WQ,T6,127))))","v":"Indoor Only"},{"$f":"IF(T6=\"\",\"\",INDEX(A:WQ,T6,124))","v":9.52},null,{"$f":"A6","v":"EZ_118_TP"},1,1,1,1,1,1,1,1,1,1,1,1,1,1,1,1,1,1,1,1,1,1,1,1,1,1,1,null,1,null,{"$f":"OR(AND(AD6=0,AE6=0,AF6=0,AG6=0,AH6=0),BF6=0)","v":false},{"$f":"OR(AND(AI6=0,AJ6=0,AK6=0,AL6=0,AM6=0),BF6=0)","v":false},{"$f":"OR(AND(AN6=0,AO6=0,AP6=0,AQ6=0,AR6=0),BF6=0)","v":false},{"$f":"OR(AND(AS6=0,AT6=0,AU6=0,AV6=0,AW6=0),BF6=0)","v":false},{"$f":"OR(AND(AX6=0,AY6=0,AZ6=0,BA6=0,BB6=0),BF6=0)","v":false},{"$f":"OR(AND(BC6=0,BD6=0),BF6=0)","v":false},null,null,{"$f":"ROW()","v":6},6,"TNC",{"$f":"INDEX(BH:BH,$BR$4)","v":false},{"$f":"IF(BS6=FALSE,BQ6,\"\")","v":6},{"$f":"SMALL(BT:BT,1)","v":6},{"$f":"IF(ISERROR(INDEX(BR:BR,BU6)),\"\",INDEX(BR:BR,BU6))","v":"TNC"},null,null,null,null,null,null,null,null,null,null,null,null,700,null,525,null,null,null,null,null,null,210,null,null,null,144,null,null,null,null,null,110,null,72,null,null,null,null,null,null,null,null,null,null,null,null,null,null,null,9.52,{"$f":"A6","v":"EZ_118_TP"},"Indoor Only",null,{"$f":"DV6","v":"Indoor Only"},null,null,{"$f":"IF(ISERROR(SMALL($S$6:$S$250,$L6)),\"\",SMALL($S$6:$S$250,$L6))","v":6},{"$f":"IF($EA6=\"\",\"\",IF(ISERROR(INDEX(A:EE,EA6,5)),EA6,INDEX(A:EE,EA6,5)))","v":0},{"$f":"IF(ISERROR(SMALL($EB$6:$EB$250,$L6)),\"\",SMALL($EB$6:$EB$250,$L6))","v":0},{"$f":"EA6","v":6},{"$f":"IF($P$2=\"\",EA6,VLOOKUP(EC6,$EB:$EE,3,FALSE))","v":6},null,{"$f":"A6","v":"EZ_118_TP"},1,1,0,0,1,0,1,0,0,0,0,0,{"$f":"IF($ET$3=\"\",INDEX($A:$ES,ROW(),137),IF(INDEX($A:$ES,ROW(),$ET$3)=1,INDEX($A:$ES,ROW(),137),\"\"))","v":"EZ_118_TP"}]
["EZ_141_TP_M17",0.32544000000000001,1.1670000000000001E-3,"N/A",{"$f":"((B7*SQRT($E$3*1000)+C7*$E$3*1000))/30480*Length*(1+'Cable Parameters'!I7/100*('Cable Parameters'!$E$1-25))+('Insertion Loss'!$F$16+'Insertion Loss'!$F$17)*SQRT($E$3)","v":0},26.5,125,-55,0.2,"https://www.ezform.com/product/ez-141m17/",3.5,2,{"$f":"ET7","v":"EZ_141_TP_M17"},null,{"$f":"IF(M7=\"\",\"\",     IF($M$4=0,ROW(), IF(ISERROR(FIND($N$4,UPPER(A7))),\"\",ROW())))","v":7},7,7,7,7,{"$f":"EE7","v":7},"EZ_141_TP_M17",26.5,3.5,0,"N/A","Indoor Only",6.35,null,"EZ_141_TP_M17",1,1,1,1,1,1,1,1,1,1,1,1,1,1,1,1,1,1,1,1,1,1,1,1,1,1,1,null,1,null,{"$f":"OR(AND(AD7=0,AE7=0,AF7=0,AG7=0,AH7=0),BF7=0)","v":false},{"$f":"OR(AND(AI7=0,AJ7=0,AK7=0,AL7=0,AM7=0),BF7=0)","v":false},{"$f":"OR(AND(AN7=0,AO7=0,AP7=0,AQ7=0,AR7=0),BF7=0)","v":false},{"$f":"OR(AND(AS7=0,AT7=0,AU7=0,AV7=0,AW7=0),BF7=0)","v":false},{"$f":"OR(AND(AX7=0,AY7=0,AZ7=0,BA7=0,BB7=0),BF7=0)","v":false},{"$f":"OR(AND(BC7=0,BD7=0),BF7=0)","v":false},null,null,{"$f":"ROW()","v":7},7,"SMA",{"$f":"INDEX(BI:BI,$BR$4)","v":false},{"$f":"IF(BS7=FALSE,BQ7,\"\")","v":7},{"$f":"SMALL(BT:BT,2)","v":7},"SMA",null,null,null,null,null,null,null,null,null,null,null,null,600,null,450,null,null,null,null,null,null,180,null,null,null,120,null,null,null,null,null,73,null,70,null,null,null,null,null,null,null,null,null,null,null,null,null,null,null,6.35,{"$f":"A7","v":"EZ_141_TP_M17"},"Indoor Only",null,{"$f":"DV7","v":"Indoor Only"},null,null,{"$f":"IF(ISERROR(SMALL($S$6:$S$250,$L7)),\"\",SMALL($S$6:$S$250,$L7))","v":7},{"$f":"IF($EA7=\"\",\"\",IF(ISERROR(INDEX(A:EE,EA7,5)),EA7,INDEX(A:EE,EA7,5)))","v":0},{"$f":"IF(ISERROR(SMALL($EB$6:$EB$250,$L7)),\"\",SMALL($EB$6:$EB$250,$L7))","v":0},{"$f":"EA7","v":7},{"$f":"IF($P$2=\"\",EA7,VLOOKUP(EC7,$EB:$EE,3,FALSE))","v":7},null,{"$f":"A7","v":"EZ_141_TP_M17"},1,1,0,0,1,0,1,0,0,0,0,0,{"$f":"IF($ET$3=\"\",INDEX($A:$ES,ROW(),137),IF(INDEX($A:$ES,ROW(),$ET$3)=1,INDEX($A:$ES,ROW(),137),\"\"))","v":"EZ_141_TP_M17"}]
["EZ_250_AL_TP",0.18629999999999999,1.1999999999999999E-3,"N/A",{"$f":"((B8*SQRT($E$3*1000)+C8*$E$3*1000))/30480*Length*(1+'Cable Parameters'!I8/100*('Cable Parameters'!$E$1-25))+('Insertion Loss'!$F$16+'Insertion Loss'!$F$17)*SQRT($E$3)","v":0},18,200,-55,0.2,"https://www.ezform.com/product/ez-250-al-as-tp/",6.4,3,"EZ_250_AL_TP",null,8,8,8,8,8,8,"EZ_250_AL_TP",18,6.4,0,"N/A","Indoor Only",19.100000000000001,null,"EZ_250_AL_TP",1,1,1,1,1,1,1,1,1,1,1,1,1,1,1,1,1,1,1,1,1,1,1,1,1,1,1,null,1,null,false,false,false,false,false,false,null,null,{"$f":"ROW()","v":8},8,"N",{"$f":"INDEX(BJ:BJ,$BR$4)","v":false},8,{"$f":"SMALL(BT:BT,3)","v":8},"N",null,null,null,null,null,null,null,null,null,null,null,null,2100,null,1700,null,null,null,null,null,null,580,null,null,null,380,null,null,null,null,null,270,null,255,null,null,null,null,null,null,null,null,null,null,null,null,null,null,null,19.100000000000001,"EZ_250_AL_TP","Indoor Only",null,"Indoor Only",null,null,8,0,0,8,8,null,"EZ_250_AL_TP",1,1,0,0,1,0,1,0,0,0,0,0,"EZ_250_AL_TP"]
["EZ_250_TP_M17",0.18629999999999999,1.1999999999999999E-3,"N/A",{"$f":"((B9*SQRT($E$3*1000)+C9*$E$3*1000))/30480*Length*(1+'Cable Parameters'!I9/100*('Cable Parameters'!$E$1-25))+('Insertion Loss'!$F$16+'Insertion Loss'!$F$17)*SQRT($E$3)","v":0},18,100,-55,0.2,"https://www.ezform.com/product/ez-250m17/",6.4,4,"EZ_250_TP_M17",null,9,9,9,9,9,9,"EZ_250_TP_M17",18,6.4,0,"N/A","Indoor Only",9.25,null,"EZ_250_TP_M17",1,1,1,1,1,1,1,1,1,1,1,1,1,1,1,1,1,1,1,1,1,1,1,1,1,1,1,null,1,null,false,false,false,false,false,false,null,null,{"$f":"ROW()","v":9},9,"BMA",{"$f":"INDEX(BK:BK,$BR$4)","v":false},9,{"$f":"SMALL(BT:BT,4)","v":9},"BMA",null,null,null,null,null,null,null,null,null,null,null,null,1900,null,1400,null,null,null,null,null,null,750,null,null,null,350,null,null,null,null,null,200,null,null,null,null,null,null,null,null,null,null,null,null,null,null,null,null,null,9.25,"EZ_250_TP_M17","Indoor Only",null,"Indoor Only",null,null,9,0,0,9,9,null,"EZ_250_TP_M17",1,1,0,0,1,0,1,0,0,0,0,0,"EZ_250_TP_M17"]
["EZ_47_AL_TP",0.10366,3.9669999999999997E-2,"N/A",{"$f":"((B10*SQRT($E$3*1000)+C10*$E$3*1000))/30480*Length*(1+'Cable Parameters'!I10/100*('Cable Parameters'!$E$1-25))+('Insertion Loss'!$F$16+'Insertion Loss'!$F$17)*SQRT($E$3)","v":0},90,125,-55,0.2,"https://www.ezform.com/product/ez-47-al-tp/",1.2,5,"EZ_47_AL_TP",null,10,10,10,10,10,10,"EZ_47_AL_TP",90,1.2,0,"N/A","Indoor Only",1.27,null,"EZ_47_AL_TP",1,1,1,1,1,1,1,1,1,1,1,1,1,1,1,1,1,1,1,1,1,1,1,1,1,1,1,null,1,null,false,false,false,false,false,false,null,null,{"$f":"ROW()","v":10},10,"7/16",{"$f":"INDEX(BL:BL,$BR$4)","v":false},10,{"$f":"SMALL(BT:BT,5)","v":10},"7/16",null,null,null,null,null,null,null,null,null,null,null,null,80,null,55,null,null,null,null,null,null,25,null,null,null,15,null,null,null,null,null,11,null,10,null,null,8,7,null,6,5,null,null,null,null,null,null,null,null,1.27,"EZ_47_AL_TP","Indoor Only",null,"Indoor Only",null,null,10,0,0,10,10,null,"EZ_47_AL_TP",1,1,0,0,1,0,1,0,0,0,0,0,"EZ_47_AL_TP"]
["EZ_47_TP_M17",4.0439999999999997E-2,3.9669999999999997E-2,"N/A",{"$f":"((B11*SQRT($E$3*1000)+C11*$E$3*1000))/30480*Length*(1+'Cable Parameters'!I11/100*('Cable Parameters'!$E$1-25))+('Insertion Loss'!$F$16+'Insertion Loss'!$F$17)*SQRT($E$3)","v":0},90,100,-55,0.2,"https://www.ezform.com/product/ez-47-tpm17-2/",1.2,6,"EZ_47_TP_M17",null,11,11,11,11,11,11,"EZ_47_TP_M17",90,1.2,0,"N/A","Indoor Only",3.18,null,"EZ_47_TP_M17",1,1,1,1,1,1,1,1,1,1,1,1,1,1,1,1,1,1,1,1,1,1,1,1,1,1,1,null,1,null,false,false,false,false,false,false,null,null,{"$f":"ROW()","v":11},11,"SMP",{"$f":"INDEX(BM:BM,$BR$4)","v":false},11,{"$f":"SMALL(BT:BT,6)","v":11},"SMP",null,null,null,null,null,null,null,null,null,null,null,null,80,null,55,null,null,null,null,null,null,25,null,null,null,15,null,null,null,null,null,11,null,10,null,null,8,7,null,6,5,null,null,null,null,null,null,null,null,3.18,"EZ_47_TP_M17","Indoor Only",null,"Indoor Only",null,null,11,0,0,11,11,null,"EZ_47_TP_M17",1,1,0,0,1,0,1,0,0,0,0,0,"EZ_47_TP_M17"]
["EZ_86_AL_TP_M17",0.61997999999999998,1.1999999999999999E-3,"N/A",{"$f":"((B12*SQRT($E$3*1000)+C12*$E$3*1000))/30480*Length*(1+'Cable Parameters'!I12/100*('Cable Parameters'!$E$1-25))+('Insertion Loss'!$F$16+'Insertion Loss'!$F$17)*SQRT($E$3)","v":0},50,125,-55,0.2,"https://www.ezform.com/product/ez-86-al-tpm17/",2.2000000000000002,7,"EZ_86_AL_TP_M17",null,12,12,12,12,12,12,"EZ_86_AL_TP_M17",50,2.2000000000000002,0,"N/A","Indoor Only",1.77,null,"EZ_86_AL_TP_M17",1,1,1,1,1,1,1,1,1,1,1,1,1,1,1,1,1,1,1,1,1,1,1,1,1,1,1,null,1,null,false,false,false,false,false,false,null,null,{"$f":"ROW()","v":12},null,null,null,null,null,null,null,null,null,null,null,null,null,null,null,null,null,null,180,null,130,null,null,null,null,null,null,54,null,null,null,35,null,null,null,null,null,20,null,null,null,null,null,null,null,null,null,null,null,null,null,null,null,null,null,1.77,"EZ_86_AL_TP_M17","Indoor Only",null,"Indoor Only",null,null,12,0,0,12,12,null,"EZ_86_AL_TP_M17",1,1,0,0,1,0,1,0,0,0,0,0,"EZ_86_AL_TP_M17"]
["EZ_86_TP_M17",0.58453999999999995,1.1999999999999999E-3,"N/A",{"$f":"((B13*SQRT($E$3*1000)+C13*$E$3*1000))/30480*Length*(1+'Cable Parameters'!I13/100*('Cable Parameters'!$E$1-25))+('Insertion Loss'!$F$16+'Insertion Loss'!$F$17)*SQRT($E$3)","v":0},50,125,-55,0.2,"https://www.ezform.com/product/ez-86-tpm17/",2.2000000000000002,8,"EZ_86_TP_M17",null,13,13,13,13,13,13,"EZ_86_TP_M17",50,2.2000000000000002,0,"N/A","Indoor Only",1.27,null,"EZ_86_TP_M17",1,1,1,1,1,1,1,1,1,1,1,1,1,1,1,1,1,1,1,1,1,1,1,1,1,1,1,null,1,null,false,false,false,false,false,false,null,null,{"$f":"ROW()","v":13},null,null,null,null,null,null,null,null,null,null,null,null,null,null,null,null,null,null,180,null,130,null,null,null,null,null,null,54,null,null,null,35,null,null,null,null,null,20,null,null,null,null,null,null,null,null,null,null,null,null,null,null,null,null,null,1.27,"EZ_86_TP_M17","Indoor Only",null,"Indoor Only",null,null,13,0,0,13,13,null,"EZ_86_TP_M17",1,1,0,0,1,0,1,0,0,0,0,0,"EZ_86_TP_M17"]
["EZ141_AL_TP_M17",0.34536,1.1999999999999999E-3,"N/A",{"$f":"((B14*SQRT($E$3*1000)+C14*$E$3*1000))/30480*Length*(1+'Cable Parameters'!I14/100*('Cable Parameters'!$E$1-25))+('Insertion Loss'!$F$16+'Insertion Loss'!$F$17)*SQRT($E$3)","v":0},26.5,125,-55,0.2,"https://www.ezform.com/product/ez-141-al-tpm17/",4,9,"EZ141_AL_TP_M17",null,14,14,14,14,14,14,"EZ141_AL_TP_M17",26.5,4,0,"N/A","Indoor Only",3.17,null,"EZ141_AL_TP_M17",1,1,1,1,1,1,1,1,1,1,1,1,1,1,1,1,1,1,1,1,1,1,1,1,1,1,1,null,1,null,false,false,false,false,false,false,null,null,{"$f":"ROW()","v":14},null,null,null,null,null,null,null,null,null,null,null,null,null,null,null,null,null,null,600,null,450,null,null,null,null,null,null,180,null,null,null,120,null,null,null,null,null,73,null,70,null,null,null,null,null,null,null,null,null,null,null,null,null,null,null,3.17,"EZ141_AL_TP_M17","Indoor Only",null,"Indoor Only",null,null,14,0,0,14,14,null,"EZ141_AL_TP_M17",1,1,0,0,1,0,1,0,0,0,0,0,"EZ141_AL_TP_M17"]
["HF HeliFoil 090",0.61099999999999999,1.3559999999999999E-4,"N/A",{"$f":"((B15*SQRT($E$3*1000)+C15*$E$3*1000))/30480*Length*(1+'Cable Parameters'!I15/100*('Cable Parameters'!$E$1-25))+('Insertion Loss'!$F$16+'Insertion Loss'!$F$17)*SQRT($E$3)","v":0},40,150,-55,0.2,"http://www.eimfirst.co.il/wp-content/uploads/2018/07/HF-090-AA-11892CHF-090.pdf",2.21,10,"HF HeliFoil 090",null,15,15,15,15,15,15,"HF HeliFoil 090",40,2.21,0,"N/A","In/Out door",9.65,null,"HF HeliFoil 090",1,1,1,1,1,1,1,1,1,1,1,1,1,1,1,1,1,1,1,1,1,1,1,1,1,1,1,null,1,null,false,false,false,false,false,false,null,null,{"$f":"ROW()","v":15},null,null,null,null,null,null,null,null,null,null,null,null,null,930,655,null,null,null,295,null,210,null,null,145,null,null,105,null,null,85,null,65,null,60,null,null,55,50,null,40,null,null,35,null,null,null,null,null,null,null,null,null,null,null,null,9.65,"HF HeliFoil 090","In/Out door","In/Out door","In/Out door",null,null,15,0,0,15,15,null,"HF HeliFoil 090",0,0,0,0,0,1,0,0,0,0,0,0,"HF HeliFoil 090"]
["HF HeliFoil 160",0.35299999999999998,1.1828999999999999E-4,"N/A",{"$f":"((B16*SQRT($E$3*1000)+C16*$E$3*1000))/30480*Length*(1+'Cable Parameters'!I16/100*('Cable Parameters'!$E$1-25))+('Insertion Loss'!$F$16+'Insertion Loss'!$F$17)*SQRT($E$3)","v":0},40,150,-55,0.2,"http://www.eimfirst.co.il/wp-content/uploads/2018/07/11594BHF-160.pdf",3.81,11,"HF HeliFoil 160",null,16,16,16,16,16,16,"HF HeliFoil 160",40,3.81,0,"N/A","In/Out door",19.05,null,"HF HeliFoil 160",1,1,1,1,1,1,1,1,1,1,1,1,1,1,1,1,1,1,1,1,1,1,1,1,1,1,1,null,1,null,false,false,false,false,false,false,null,null,{"$f":"ROW()","v":16},null,null,null,null,null,null,null,null,null,null,null,null,null,2175,1540,null,null,null,685,null,485,null,null,340,null,null,240,null,null,195,null,150,null,135,null,null,120,110,null,90,null,null,75,null,null,null,null,null,null,null,null,null,null,null,null,19.05,"HF HeliFoil 160","In/Out door","In/Out door","In/Out door",null,null,16,0,0,16,16,null,"HF HeliFoil 160",0,0,0,0,0,1,0,0,0,0,0,0,"HF HeliFoil 160"]
["HF HeliFoil 190",0.23837,1.671E-4,"N/A",{"$f":"((B17*SQRT($E$3*1000)+C17*$E$3*1000))/30480*Length*(1+'Cable Parameters'!I17/100*('Cable Parameters'!$E$1-25))+('Insertion Loss'!$F$16+'Insertion Loss'!$F$17)*SQRT($E$3)","v":0},26.5,150,-55,0.2,"http://www.eimfirst.co.il/wp-content/uploads/2018/07/9185BHF-190.pdf",5,12,"HF HeliFoil 190",null,17,17,17,17,17,17,"HF HeliFoil 190",26.5,5,0,"N/A","In/Out door",25.4,null,"HF HeliFoil 190",1,1,1,1,1,1,1,1,1,1,1,1,1,1,1,1,1,1,1,1,1,1,1,1,1,1,1,null,1,null,false,false,false,false,false,false,null,null,{"$f":"ROW()","v":17},null,null,null,null,null,null,null,null,null,null,null,null,null,3765,2660,null,null,null,1180,null,830,null,null,585,null,null,410,null,null,330,null,255,null,230,null,null,200,185,null,150,null,null,null,null,null,null,null,null,null,null,null,null,null,null,null,25.4,"HF HeliFoil 190","In/Out door","In/Out door","In/Out door",null,null,17,0,0,17,17,null,"HF HeliFoil 190",0,0,0,0,0,1,0,0,0,0,0,0,"HF HeliFoil 190"]
["HF HeliFoil 290",0.13896,1.34E-4,"N/A",{"$f":"((B18*SQRT($E$3*1000)+C18*$E$3*1000))/30480*Length*(1+'Cable Parameters'!I18/100*('Cable Parameters'!$E$1-25))+('Insertion Loss'!$F$16+'Insertion Loss'!$F$17)*SQRT($E$3)","v":0},18,150,-55,0.2,"http://www.eimfirst.co.il/wp-content/uploads/2018/07/9186CHF-290.pdf",7.6,13,"HF HeliFoil 290",null,18,18,18,18,18,18,"HF HeliFoil 290",18,7.6,0,"N/A","In/Out door",38.1,null,"HF HeliFoil 290",1,1,1,1,1,1,1,1,1,1,1,1,1,1,1,1,1,1,1,1,1,1,1,1,1,1,1,null,1,null,false,false,false,false,false,false,null,null,{"$f":"ROW()","v":18},null,null,null,null,null,null,null,null,null,null,null,null,null,8645,6100,null,null,null,2700,null,1895,null,null,1325,null,null,925,null,null,745,null,570,null,515,null,null,440,415,null,null,null,null,null,null,null,null,null,null,null,null,null,null,null,null,null,38.1,"HF HeliFoil 290","In/Out door","In/Out door","In/Out door",null,null,18,0,0,18,18,null,"HF HeliFoil 290",0,0,0,0,0,1,0,0,0,0,0,0,"HF HeliFoil 290"]
["HF HeliFoil 290PUR",0.13134000000000001,1.3410000000000001E-4,"N/A",{"$f":"((B19*SQRT($E$3*1000)+C19*$E$3*1000))/30480*Length*(1+'Cable Parameters'!I19/100*('Cable Parameters'!$E$1-25))+('Insertion Loss'!$F$16+'Insertion Loss'!$F$17)*SQRT($E$3)","v":0},18,85,-55,0.2,"http://www.eimfirst.co.il/wp-content/uploads/2018/07/11456BHF-290-PUR.pdf",9,14,"HF HeliFoil 290PUR",null,19,19,19,19,19,19,"HF HeliFoil 290PUR",18,9,0,"N/A","In/Out door",50.8,null,"HF HeliFoil 290PUR",1,1,1,1,1,1,1,1,1,1,1,1,1,1,1,1,1,1,1,1,1,1,1,1,1,1,1,null,1,null,false,false,false,false,false,false,null,null,{"$f":"ROW()","v":19},null,null,null,null,null,null,null,null,null,null,null,null,null,null,null,null,null,null,{"$f":"1.69*1000","v":1690},null,{"$f":"1000*1.19","v":1190},null,null,830,null,670,580,510,null,470,null,360,null,320,null,null,280,260,null,null,null,null,null,null,null,null,null,null,null,null,null,null,null,null,null,50.8,"HF HeliFoil 290PUR","In/Out door","In/Out door","In/Out door",null,null,19,0,0,19,19,null,"HF HeliFoil 290PUR",0,0,0,0,0,1,0,0,0,0,0,0,"HF HeliFoil 290PUR"]
["LLSB-1200",4.3959999999999999E-2,1.9000000000000001E-4,"N/A",{"$f":"((B20*SQRT($E$3*1000)+C20*$E$3*1000))/30480*Length*(1+'Cable Parameters'!I20/100*('Cable Parameters'!$E$1-25))+('Insertion Loss'!$F$16+'Insertion Loss'!$F$17)*SQRT($E$3)","v":0},2.5,85,-40,0.2,"http://www.eimfirst.co.il/wp-content/uploads/2018/08/Qeam-Tactical-Brochure.pdf",30.48,15,"LLSB-1200",null,20,20,20,20,20,20,"LLSB-1200",2.5,30.48,0,"N/A","In/Out door",279.39999999999998,null,"LLSB-1200",1,1,1,1,1,1,1,1,1,1,1,1,1,1,1,1,1,1,1,1,1,1,1,1,1,1,1,null,1,null,false,false,false,false,false,false,null,null,{"$f":"ROW()","v":20},null,null,null,null,null,null,null,null,null,null,null,null,13000,9700,null,5500,null,3100,null,2100,null,null,1400,null,1200,null,null,null,null,null,null,null,null,null,null,null,null,null,null,null,null,null,null,null,null,null,null,null,null,null,null,null,null,null,null,279.39999999999998,"LLSB-1200","In/Out door","In/Out door","In/Out door",null,null,20,0,0,20,20,null,"LLSB-1200",0,0,1,0,0,0,0,0,0,0,0,0,"LLSB-1200"]
["LLSB-400",0.14387,3.1E-4,"N/A",{"$f":"((B21*SQRT($E$3*1000)+C21*$E$3*1000))/30480*Length*(1+'Cable Parameters'!I21/100*('Cable Parameters'!$E$1-25))+('Insertion Loss'!$F$16+'Insertion Loss'!$F$17)*SQRT($E$3)","v":0},6,85,-40,0.2,"http://www.eimfirst.co.il/wp-content/uploads/2018/08/Qeam-Tactical-Brochure.pdf",10.199999999999999,16,"LLSB-400",null,21,21,21,21,21,21,"LLSB-400",6,10.199999999999999,0,"N/A","In/Out door",101.6,null,"LLSB-400",1,1,1,1,1,1,1,1,1,1,1,1,1,1,1,1,1,1,1,1,1,1,1,1,1,1,1,null,1,null,false,false,false,false,false,false,null,null,{"$f":"ROW()","v":21},null,null,null,null,null,null,null,null,null,null,null,null,3000,2600,null,1500,null,800,null,600,null,null,400,null,300,null,null,null,null,200,null,null,null,null,null,null,null,null,null,null,null,null,null,null,null,null,null,null,null,null,null,null,null,null,null,101.6,"LLSB-400","In/Out door","In/Out door","In/Out door",null,null,21,0,0,21,21,null,"LLSB-400",0,0,1,0,0,0,0,0,0,0,0,0,"LLSB-400"]
["LLSB-600",8.8880000000000001E-2,3.1E-4,"N/A",{"$f":"((B22*SQRT($E$3*1000)+C22*$E$3*1000))/30480*Length*(1+'Cable Parameters'!I22/100*('Cable Parameters'!$E$1-25))+('Insertion Loss'!$F$16+'Insertion Loss'!$F$17)*SQRT($E$3)","v":0},6,85,-40,0.2,"http://www.eimfirst.co.il/wp-content/uploads/2018/08/Qeam-Tactical-Brochure.pdf",15,17,"LLSB-600",null,22,22,22,22,22,22,"LLSB-600",6,15,0,"N/A","In/Out door",152.4,null,"LLSB-600",1,1,1,1,1,1,1,1,1,1,1,1,1,1,1,1,1,1,1,1,1,1,1,1,1,1,1,null,1,null,false,false,false,false,false,false,null,null,{"$f":"ROW()","v":22},null,null,null,null,null,null,null,null,null,null,null,null,6000,4200,null,2400,null,1300,null,900,null,null,600,null,500,null,null,null,null,300,null,null,null,null,null,null,null,null,null,null,null,null,null,null,null,null,null,null,null,null,null,null,null,null,null,152.4,"LLSB-600","In/Out door","In/Out door","In/Out door",null,null,22,0,0,22,22,null,"LLSB-600",0,0,1,0,0,0,0,0,0,0,0,0,"LLSB-600"]
["LLSB-900",6.0909999999999999E-2,1.9000000000000001E-4,"N/A",{"$f":"((B23*SQRT($E$3*1000)+C23*$E$3*1000))/30480*Length*(1+'Cable Parameters'!I23/100*('Cable Parameters'!$E$1-25))+('Insertion Loss'!$F$16+'Insertion Loss'!$F$17)*SQRT($E$3)","v":0},6,85,-40,0.2,"http://www.eimfirst.co.il/wp-content/uploads/2018/08/Qeam-Tactical-Brochure.pdf",22.1,18,"LLSB-900",null,23,23,23,23,23,23,"LLSB-900",6,22.1,0,"N/A","In/Out door",228.6,null,"LLSB-900",1,1,1,1,1,1,1,1,1,1,1,1,1,1,1,1,1,1,1,1,1,1,1,1,1,1,1,null,1,null,false,false,false,false,false,false,null,null,{"$f":"ROW()","v":23},null,null,null,null,null,null,null,null,null,null,null,null,9000,6900,null,3900,null,2200,null,1500,null,null,1000,null,900,null,null,null,null,500,null,null,null,null,null,null,null,null,null,null,null,null,null,null,null,null,null,null,null,null,null,null,null,null,null,228.6,"LLSB-900","In/Out door","In/Out door","In/Out door",null,null,23,0,0,23,23,null,"LLSB-900",0,0,1,0,0,0,0,0,0,0,0,0,"LLSB-900"]
["LMR 400",0.12229,2.5999999999999998E-4,"N/A",{"$f":"((B24*SQRT($E$3*1000)+C24*$E$3*1000))/30480*Length*(1+'Cable Parameters'!I24/100*('Cable Parameters'!$E$1-25))+('Insertion Loss'!$F$16+'Insertion Loss'!$F$17)*SQRT($E$3)","v":0},6,85,-40,0.2,"http://www.eimfirst.co.il/wp-content/uploads/2018/09/TCOM-400-600.pdf",10,19,"LMR 400",null,24,24,24,24,24,24,"LMR 400",6,10,0,"N/A","In/Out door",101.6,null,"LMR 400",1,1,1,1,1,1,1,1,1,1,1,1,1,1,1,1,1,1,1,1,1,1,1,1,1,1,1,null,1,null,false,false,false,false,false,false,null,null,{"$f":"ROW()","v":24},null,null,null,null,null,null,null,null,null,null,null,null,3300,2600,null,1500,null,800,null,600,null,null,400,null,300,null,null,null,null,200,null,null,null,null,null,null,null,null,null,null,null,null,null,null,null,null,null,null,null,null,null,null,null,null,null,101.6,"LMR 400","In/Out door","In/Out door","In/Out door",null,null,24,0,0,24,24,null,"LMR 400",0,0,0,0,1,1,1,0,0,0,1,1,"LMR 400"]
["LMR 400 UF",0.13766999999999999,3.6999999999999999E-4,"N/A",{"$f":"((B25*SQRT($E$3*1000)+C25*$E$3*1000))/30480*Length*(1+'Cable Parameters'!I25/100*('Cable Parameters'!$E$1-25))+('Insertion Loss'!$F$16+'Insertion Loss'!$F$17)*SQRT($E$3)","v":0},6,85,-40,0.2,"http://www.eimfirst.co.il/wp-content/uploads/2018/09/TCOM-400-600.pdf",10,20,"LMR 400 UF",null,25,25,25,25,25,25,"LMR 400 UF",6,10,0,"N/A","In/Out door",101.6,null,"LMR 400 UF",1,1,1,1,1,1,1,1,1,1,1,1,1,1,1,1,1,1,1,1,1,1,1,1,1,1,1,null,1,null,false,false,false,false,false,false,null,null,{"$f":"ROW()","v":25},null,null,null,null,null,null,null,null,null,null,null,null,2900,2300,null,1300,null,700,null,500,null,null,300,null,300,null,null,null,null,300,null,null,null,null,null,null,null,null,null,null,null,null,null,null,null,null,null,null,null,null,null,null,null,null,null,101.6,"LMR 400 UF","In/Out door","In/Out door","In/Out door",null,null,25,0,0,25,25,null,"LMR 400 UF",0,0,0,0,1,1,1,0,0,0,1,1,"LMR 400 UF"]
["LMR 600",7.5550000000000006E-2,2.5999999999999998E-4,"N/A",{"$f":"((B26*SQRT($E$3*1000)+C26*$E$3*1000))/30480*Length*(1+'Cable Parameters'!I26/100*('Cable Parameters'!$E$1-25))+('Insertion Loss'!$F$16+'Insertion Loss'!$F$17)*SQRT($E$3)","v":0},6,85,-40,0.2,"http://www.eimfirst.co.il/wp-content/uploads/2018/09/TCOM-400-600.pdf",15,21,"LMR 600",null,26,26,26,26,26,26,"LMR 600",6,15,0,"N/A","In/Out door",152.4,null,"LMR 600",1,1,1,1,1,1,1,1,1,1,1,1,1,1,1,1,1,1,1,1,1,1,1,1,1,1,1,null,1,null,false,false,false,false,false,false,null,null,{"$f":"ROW()","v":26},null,null,null,null,null,null,null,null,null,null,null,null,5500,4200,null,2400,null,1300,null,900,null,null,600,null,500,null,null,null,null,300,null,null,null,null,null,null,null,null,null,null,null,null,null,null,null,null,null,null,null,null,null,null,null,null,null,152.4,"LMR 600","In/Out door","In/Out door","In/Out door",null,null,26,0,0,26,26,null,"LMR 600",0,0,0,0,1,1,1,0,0,0,1,1,"LMR 600"]
["LMR 600 UF",9.0660000000000004E-2,3.1E-4,"N/A",{"$f":"((B27*SQRT($E$3*1000)+C27*$E$3*1000))/30480*Length*(1+'Cable Parameters'!I27/100*('Cable Parameters'!$E$1-25))+('Insertion Loss'!$F$16+'Insertion Loss'!$F$17)*SQRT($E$3)","v":0},6,85,-40,0.2,"http://www.eimfirst.co.il/wp-content/uploads/2018/09/TCOM-400-600.pdf",15,22,"LMR 600 UF",null,27,27,27,27,27,27,"LMR 600 UF",6,15,0,"N/A","In/Out door",152.4,null,"LMR 600 UF",1,1,1,1,1,1,1,1,1,1,1,1,1,1,1,1,1,1,1,1,1,1,1,1,1,1,1,null,1,null,false,false,false,false,false,false,null,null,{"$f":"ROW()","v":27},null,null,null,null,null,null,null,null,null,null,null,null,4600,3500,null,2000,null,1100,null,800,null,null,500,null,400,null,null,null,null,300,null,null,null,null,null,null,null,null,null,null,null,null,null,null,null,null,null,null,null,null,null,null,null,null,null,152.4,"LMR 600 UF","In/Out door","In/Out door","In/Out door",null,null,27,0,0,27,27,null,"LMR 600 UF",0,0,0,0,1,1,1,0,0,0,1,1,"LMR 600 UF"]
["LMR 900",5.1769999999999997E-2,1.6000000000000001E-4,"N/A",{"$f":"((B28*SQRT($E$3*1000)+C28*$E$3*1000))/30480*Length*(1+'Cable Parameters'!I28/100*('Cable Parameters'!$E$1-25))+('Insertion Loss'!$F$16+'Insertion Loss'!$F$17)*SQRT($E$3)","v":0},6,85,-40,0.2,"http://www.eimfirst.co.il/wp-content/uploads/2018/09/TCOM-400-600.pdf",22,23,"LMR 900",null,28,28,28,28,28,28,"LMR 900",6,22,0,"N/A","In/Out door",228.6,null,"LMR 900",1,1,1,1,1,1,1,1,1,1,1,1,1,1,1,1,1,1,1,1,1,1,1,1,1,1,1,null,1,null,false,false,false,false,false,false,null,null,{"$f":"ROW()","v":28},null,null,null,null,null,null,null,null,null,null,null,null,8900,6900,null,3900,null,2200,null,1500,null,null,1000,null,900,null,null,null,null,null,null,null,null,null,null,null,null,null,null,null,null,null,null,null,null,null,null,null,null,null,null,null,null,null,null,228.6,"LMR 900","In/Out door","In/Out door","In/Out door",null,null,28,0,0,28,28,null,"LMR 900",0,0,0,0,1,1,1,0,0,0,1,1,"LMR 900"]
["LMR 1200",3.737E-2,1.6000000000000001E-4,"N/A",{"$f":"((B29*SQRT($E$3*1000)+C29*$E$3*1000))/30480*Length*(1+'Cable Parameters'!I29/100*('Cable Parameters'!$E$1-25))+('Insertion Loss'!$F$16+'Insertion Loss'!$F$17)*SQRT($E$3)","v":0},2.5,85,-40,0.2,"http://www.eimfirst.co.il/wp-content/uploads/2018/09/TCOM-400-600.pdf",30,24,"LMR 1200",null,29,29,29,29,29,29,"LMR 1200",2.5,30,0,"N/A","In/Out door",279.39999999999998,null,"LMR 1200",1,1,1,1,1,1,1,1,1,1,1,1,1,1,1,1,1,1,1,1,1,1,1,1,1,1,1,null,1,null,false,false,false,false,false,false,null,null,{"$f":"ROW()","v":29},null,null,null,null,null,null,null,null,null,null,null,null,13000,9700,null,5500,null,3100,null,2100,null,null,1400,null,1200,null,null,null,null,200,null,null,null,null,null,null,null,null,null,null,null,null,null,null,null,null,null,null,null,null,null,null,null,null,null,279.39999999999998,"LMR 1200","In/Out door","In/Out door","In/Out door",null,null,29,0,0,29,29,null,"LMR 1200",0,0,0,0,1,1,1,0,0,0,1,1,"LMR 1200"]
["LMR-400-FR",0.1241,2.4499999999999999E-4,"N/A",{"$f":"((B30*SQRT($E$3*1000)+C30*$E$3*1000))/30480*Length*(1+'Cable Parameters'!I30/100*('Cable Parameters'!$E$1-25))+('Insertion Loss'!$F$16+'Insertion Loss'!$F$17)*SQRT($E$3)","v":0},3,85,-40,0.2,"http://www.eimfirst.co.il/wp-content/uploads/2018/09/LMR-FR.pdf",10.29,25,"LMR-400-FR",null,30,30,30,30,30,30,"LMR-400-FR",3,10.29,0,"N/A","In/Out door",25.4,null,"LMR-400-FR",1,1,1,1,1,1,1,1,1,1,1,1,1,1,1,1,1,1,1,1,1,1,1,1,1,1,1,null,1,null,false,false,false,false,false,false,null,null,{"$f":"ROW()","v":30},null,null,null,null,null,null,null,null,null,null,null,12611,null,6527,4591,null,null,null,null,null,1398,1128,null,967,958,777,null,null,null,null,null,null,null,null,null,null,null,null,null,null,null,null,null,null,null,null,null,null,null,null,null,null,null,null,null,25.4,"LMR-400-FR","In/Out door","In/Out door","In/Out door",null,null,30,0,0,30,30,null,"LMR-400-FR",0,0,1,0,1,1,1,0,0,1,1,1,"LMR-400-FR"]
["LMR-500-FR",9.5640000000000003E-2,2.5900000000000001E-4,"N/A",{"$f":"((B31*SQRT($E$3*1000)+C31*$E$3*1000))/30480*Length*(1+'Cable Parameters'!I31/100*('Cable Parameters'!$E$1-25))+('Insertion Loss'!$F$16+'Insertion Loss'!$F$17)*SQRT($E$3)","v":0},3,85,-40,0.2,"http://www.eimfirst.co.il/wp-content/uploads/2018/09/LMR-FR.pdf",12.7,26,"LMR-500-FR",null,31,31,31,31,31,31,"LMR-500-FR",3,12.7,0,"N/A","In/Out door",31.8,null,"LMR-500-FR",1,1,1,1,1,1,1,1,1,1,1,1,1,1,1,1,1,1,1,1,1,1,1,1,1,1,1,null,1,null,false,false,false,false,false,false,null,null,{"$f":"ROW()","v":31},null,null,null,null,null,null,null,null,null,null,null,18784,null,9703,6813,null,null,null,null,null,2050,1648,null,1408,1246,1126,null,null,null,null,null,null,null,null,null,null,null,null,null,null,null,null,null,null,null,null,null,null,null,null,null,null,null,null,null,31.8,"LMR-500-FR","In/Out door","In/Out door","In/Out door",null,null,31,0,0,31,31,null,"LMR-500-FR",0,0,1,0,1,1,1,0,0,1,1,1,"LMR-500-FR"]
["LMR-600-FR",7.7990000000000004E-2,2.24E-4,"N/A",{"$f":"((B32*SQRT($E$3*1000)+C32*$E$3*1000))/30480*Length*(1+'Cable Parameters'!I32/100*('Cable Parameters'!$E$1-25))+('Insertion Loss'!$F$16+'Insertion Loss'!$F$17)*SQRT($E$3)","v":0},3,85,-40,0.2,"http://www.eimfirst.co.il/wp-content/uploads/2018/09/LMR-FR.pdf",15,27,"LMR-600-FR",null,32,32,32,32,32,32,"LMR-600-FR",3,15,0,"N/A","In/Out door",38.1,null,"LMR-600-FR",1,1,1,1,1,1,1,1,1,1,1,1,1,1,1,1,1,1,1,1,1,1,1,1,1,1,1,null,1,null,false,false,false,false,false,false,null,null,{"$f":"ROW()","v":32},null,null,null,null,null,null,null,null,null,null,null,26034,null,13433,9423,null,null,null,null,null,2816,2259,null,1928,1702,1537,null,null,null,null,null,null,null,null,null,null,null,null,null,null,null,null,null,null,null,null,null,null,null,null,null,null,null,null,null,38.1,"LMR-600-FR","In/Out door","In/Out door","In/Out door",null,null,32,0,0,32,32,null,"LMR-600-FR",0,0,1,0,1,1,1,0,0,1,1,1,"LMR-600-FR"]
["LMR-900-FR",5.1868999999999998E-2,1.9799999999999999E-4,"N/A",{"$f":"((B33*SQRT($E$3*1000)+C33*$E$3*1000))/30480*Length*(1+'Cable Parameters'!I33/100*('Cable Parameters'!$E$1-25))+('Insertion Loss'!$F$16+'Insertion Loss'!$F$17)*SQRT($E$3)","v":0},3,85,-40,0.2,"http://www.eimfirst.co.il/wp-content/uploads/2018/09/LMR-FR.pdf",22.1,28,"LMR-900-FR",null,33,33,33,33,33,33,"LMR-900-FR",3,22.1,0,"N/A","In/Out door",76.2,null,"LMR-900-FR",1,1,1,1,1,1,1,1,1,1,1,1,1,1,1,1,1,1,1,1,1,1,1,1,1,1,1,null,1,null,false,false,false,false,false,false,null,null,{"$f":"ROW()","v":33},null,null,null,null,null,null,null,null,null,null,null,49886,null,25658,17951,null,null,null,null,null,5267,4202,null,3570,3140,2825,null,null,null,null,null,null,null,null,null,null,null,null,null,null,null,null,null,null,null,null,null,null,null,null,null,null,null,null,null,76.2,"LMR-900-FR","In/Out door","In/Out door","In/Out door",null,null,33,0,0,33,33,null,"LMR-900-FR",0,0,1,0,1,1,1,0,0,1,1,1,"LMR-900-FR"]
["LMR-1200-FR",3.7474E-2,1.55E-4,"N/A",{"$f":"((B34*SQRT($E$3*1000)+C34*$E$3*1000))/30480*Length*(1+'Cable Parameters'!I34/100*('Cable Parameters'!$E$1-25))+('Insertion Loss'!$F$16+'Insertion Loss'!$F$17)*SQRT($E$3)","v":0},3,85,-40,0.2,"http://www.eimfirst.co.il/wp-content/uploads/2018/09/LMR-FR.pdf",30.48,29,"LMR-1200-FR",null,34,34,34,34,34,34,"LMR-1200-FR",3,30.48,0,"N/A","In/Out door",165.1,null,"LMR-1200-FR",1,1,1,1,1,1,1,1,1,1,1,1,1,1,1,1,1,1,1,1,1,1,1,1,1,1,1,null,1,null,false,false,false,false,false,false,null,null,{"$f":"ROW()","v":34},null,null,null,null,null,null,null,null,null,null,null,81747,null,41991,29346,null,null,null,null,null,8547,6803,null,5769,5067,4552,null,null,null,null,null,null,null,null,null,null,null,null,null,null,null,null,null,null,null,null,null,null,null,null,null,null,null,null,null,165.1,"LMR-1200-FR","In/Out door","In/Out door","In/Out door",null,null,34,0,0,34,34,null,"LMR-1200-FR",0,0,1,0,1,1,1,0,0,1,1,1,"LMR-1200-FR"]
["LMR-400-LLPL",0.127694,1.7699999999999999E-4,"N/A",{"$f":"((B35*SQRT($E$3*1000)+C35*$E$3*1000))/30480*Length*(1+'Cable Parameters'!I35/100*('Cable Parameters'!$E$1-25))+('Insertion Loss'!$F$16+'Insertion Loss'!$F$17)*SQRT($E$3)","v":0},3,75,-5,0.2,"http://www.eimfirst.co.il/wp-content/uploads/2018/09/LMR-LLPL.pdf",10.28,30,"LMR-400-LLPL",null,35,35,35,35,35,35,"LMR-400-LLPL",3,10.28,0,"N/A","In/Out door",101.6,null,"LMR-400-LLPL",1,1,1,1,1,1,1,1,1,1,1,1,1,1,1,1,1,1,1,1,1,1,1,1,1,1,1,null,1,null,false,false,false,false,false,false,null,null,{"$f":"ROW()","v":35},null,null,null,null,null,null,null,null,null,null,null,10052,null,5212,3672,null,null,null,null,null,1131,915,null,787,700,635,null,null,null,null,null,null,null,null,null,null,null,null,null,null,null,null,null,null,null,null,null,null,null,null,null,null,null,null,null,101.6,"LMR-400-LLPL","In/Out door","In/Out door","In/Out door",null,null,35,0,0,35,35,null,"LMR-400-LLPL",0,0,0,0,1,1,1,0,0,1,1,1,"LMR-400-LLPL"]
["LMR-500-LLPL",0.1031,1.85E-4,"N/A",{"$f":"((B36*SQRT($E$3*1000)+C36*$E$3*1000))/30480*Length*(1+'Cable Parameters'!I36/100*('Cable Parameters'!$E$1-25))+('Insertion Loss'!$F$16+'Insertion Loss'!$F$17)*SQRT($E$3)","v":0},3,75,-5,0.2,"http://www.eimfirst.co.il/wp-content/uploads/2018/09/LMR-LLPL.pdf",12.7,31,"LMR-500-LLPL",null,36,36,36,36,36,36,"LMR-500-LLPL",3,12.7,0,"N/A","In/Out door",127,null,"LMR-500-LLPL",1,1,1,1,1,1,1,1,1,1,1,1,1,1,1,1,1,1,1,1,1,1,1,1,1,1,1,null,1,null,false,false,false,false,false,false,null,null,{"$f":"ROW()","v":36},null,null,null,null,null,null,null,null,null,null,null,14391,null,7452,5244,null,null,null,null,null,1602,1294,null,1110,985,893,null,null,null,null,null,null,null,null,null,null,null,null,null,null,null,null,null,null,null,null,null,null,null,null,null,null,null,null,null,127,"LMR-500-LLPL","In/Out door","In/Out door","In/Out door",null,null,36,0,0,36,36,null,"LMR-500-LLPL",0,0,0,0,1,1,1,0,0,1,1,1,"LMR-500-LLPL"]
["LMR-600-LLPL",8.6249999999999993E-2,1.83E-4,"N/A",{"$f":"((B37*SQRT($E$3*1000)+C37*$E$3*1000))/30480*Length*(1+'Cable Parameters'!I37/100*('Cable Parameters'!$E$1-25))+('Insertion Loss'!$F$16+'Insertion Loss'!$F$17)*SQRT($E$3)","v":0},3,75,-5,0.2,"http://www.eimfirst.co.il/wp-content/uploads/2018/09/LMR-LLPL.pdf",15,32,"LMR-600-LLPL",null,37,37,37,37,37,37,"LMR-600-LLPL",3,15,0,"N/A","In/Out door",152.4,null,"LMR-600-LLPL",1,1,1,1,1,1,1,1,1,1,1,1,1,1,1,1,1,1,1,1,1,1,1,1,1,1,1,null,1,null,false,false,false,false,false,false,null,null,{"$f":"ROW()","v":37},null,null,null,null,null,null,null,null,null,null,null,19407,null,10038,7057,null,null,null,null,null,2140,1725,null,1477,1309,1184,null,null,null,null,null,null,null,null,null,null,null,null,null,null,null,null,null,null,null,null,null,null,null,null,null,null,null,null,null,152.4,"LMR-600-LLPL","In/Out door","In/Out door","In/Out door",null,null,37,0,0,37,37,null,"LMR-600-LLPL",0,0,0,0,1,1,1,0,0,1,1,1,"LMR-600-LLPL"]
["LMR-900-LLPL",5.493E-2,1.83E-4,"N/A",{"$f":"((B38*SQRT($E$3*1000)+C38*$E$3*1000))/30480*Length*(1+'Cable Parameters'!I38/100*('Cable Parameters'!$E$1-25))+('Insertion Loss'!$F$16+'Insertion Loss'!$F$17)*SQRT($E$3)","v":0},3,75,-5,0.2,"http://www.eimfirst.co.il/wp-content/uploads/2018/09/LMR-LLPL.pdf",22.1,33,"LMR-900-LLPL",null,38,{"$f":"IF(O38=\"\",\"\",IF($P$2=\"\",O38,IF(OR(INDEX(A:M,ROW(),6)=$P$2,INDEX(A:M,ROW(),6)>$P$2),ROW(),\"\")))","v":38},{"$f":"IF(P38=\"\",\"\",IF($Q$2=\"\",P38,IF(INDEX(DV:DW,ROW(),$Q$2)=\"\",\"\",ROW())))","v":38},{"$f":"IF(Q38=\"\",\"\",IF($R$2=\"\",Q38,IF(OR(INDEX(A:WQ,ROW(),4)=$R$2,INDEX(A:WQ,ROW(),4)>$R$2),ROW(),\"\")))","v":38},{"$f":"IF(R38=\"\",\"\",IF($S$2=\"\",R38,IF(OR(INDEX(A:N,ROW(),11)>$S$2+1,INDEX(A:N,ROW(),11)<$S$2-1),\"\",ROW())))","v":38},38,{"$f":"IF(T38=\"\",\"\",INDEX(A:M,T38,1))","v":"LMR-900-LLPL"},{"$f":"IF(T38=\"\",\"\",INDEX(A:N,T38,6))","v":3},{"$f":"IF(T38=\"\",\"\",INDEX(A:O,T38,11))","v":22.1},{"$f":"IF(T38=\"\",\"\",INDEX(A:P,T38,5))","v":0},{"$f":"IF(T38=\"\",\"\",INDEX(A:R,T38,4))","v":"N/A"},{"$f":"IF(ISERROR(IF($Q$2=\"\",INDEX(A:WQ,T38,128),IF($Q$2=1,INDEX(A:WQ,T38,126),INDEX(A:WQ,T38,127)))),\"\",IF($Q$2=\"\",INDEX(A:WQ,T38,128),IF($Q$2=1,INDEX(A:WQ,T38,126),INDEX(A:WQ,T38,127))))","v":"In/Out door"},{"$f":"IF(T38=\"\",\"\",INDEX(A:WQ,T38,124))","v":228.6},null,"LMR-900-LLPL",1,1,1,1,1,1,1,1,1,1,1,1,1,1,1,1,1,1,1,1,1,1,1,1,1,1,1,null,1,null,false,false,false,false,false,false,null,null,{"$f":"ROW()","v":38},null,null,null,null,null,null,null,null,null,null,null,38959,null,20069,14060,null,null,null,null,null,4163,3330,null,2835,2499,2251,null,null,null,null,null,null,null,null,null,null,null,null,null,null,null,null,null,null,null,null,null,null,null,null,null,null,null,null,null,228.6,"LMR-900-LLPL","In/Out door","In/Out door","In/Out door",null,null,38,0,0,38,38,null,"LMR-900-LLPL",0,0,0,0,1,1,1,0,0,1,1,1,"LMR-900-LLPL"]
["LMR-1200-LLPL",4.2798000000000003E-2,1.55E-4,"N/A",{"$f":"((B39*SQRT($E$3*1000)+C39*$E$3*1000))/30480*Length*(1+'Cable Parameters'!I39/100*('Cable Parameters'!$E$1-25))+('Insertion Loss'!$F$16+'Insertion Loss'!$F$17)*SQRT($E$3)","v":0},3,75,-5,0.2,"http://www.eimfirst.co.il/wp-content/uploads/2018/09/LMR-LLPL.pdf",30,34,"LMR-1200-LLPL",null,39,39,39,39,39,39,"LMR-1200-LLPL",3,30,0,"N/A","In/Out door",304.8,null,"LMR-1200-LLPL",1,1,1,1,1,1,1,1,1,1,1,1,1,1,1,1,1,1,1,1,1,1,1,1,1,1,1,null,1,null,false,false,false,false,false,false,null,null,{"$f":"ROW()","v":39},null,null,null,null,null,null,null,null,null,null,null,58185,null,29945,20962,null,null,null,null,null,6172,4929,null,4191,3689,3320,null,null,null,null,null,null,null,null,null,null,null,null,null,null,null,null,null,null,null,null,null,null,null,null,null,null,null,null,null,304.8,"LMR-1200-LLPL","In/Out door","In/Out door","In/Out door",null,null,39,0,0,39,39,null,"LMR-1200-LLPL",0,0,0,0,1,1,1,0,0,1,1,1,"LMR-1200-LLPL"]
["LMR-1700-DB-TPV",2.6741000000000001E-2,1.4999999999999999E-4,"N/A",{"$f":"((B40*SQRT($E$3*1000)+C40*$E$3*1000))/30480*Length*(1+'Cable Parameters'!I40/100*('Cable Parameters'!$E$1-25))+('Insertion Loss'!$F$16+'Insertion Loss'!$F$17)*SQRT($E$3)","v":0},3,105,-50,0.2,"http://www.eimfirst.co.il/wp-content/uploads/2018/09/Some-Other-Cables-2.pdf",40.64,35,"LMR-1700-DB-TPV",null,40,40,40,40,40,40,"LMR-1700-DB-TPV",3,40.64,0,"N/A","In/Out door",342.9,null,"LMR-1700-DB-TPV",1,1,1,1,1,1,1,1,1,1,1,1,1,1,1,1,1,1,1,1,1,1,1,1,1,1,1,null,1,null,false,false,false,false,false,false,null,null,{"$f":"ROW()","v":40},null,null,null,null,null,null,null,null,null,null,null,81965,null,41916,29185,null,null,null,null,null,8293,6553,null,5525,4830,4320,null,null,null,null,null,null,null,null,null,null,null,null,null,null,null,null,null,null,null,null,null,null,null,null,null,null,null,null,null,342.9,"LMR-1700-DB-TPV","In/Out door","In/Out door","In/Out door",null,null,40,0,0,40,40,null,"LMR-1700-DB-TPV",0,0,0,0,1,1,1,0,0,0,1,1,"LMR-1700-DB-TPV"]
["MaxGain160",0.36959999999999998,1.3410000000000001E-4,"N/A",{"$f":"((B41*SQRT($E$3*1000)+C41*$E$3*1000))/30480*Length*(1+'Cable Parameters'!I41/100*('Cable Parameters'!$E$1-25))+('Insertion Loss'!$F$16+'Insertion Loss'!$F$17)*SQRT($E$3)","v":0},40,150,-55,0.2,"http://www.eimfirst.co.il/wp-content/uploads/2018/09/Maxgain-Brochure-1.pdf",4,36,"MaxGain160",null,41,41,41,41,41,41,"MaxGain160",40,4,0,"N/A","In/Out door",19,null,"MaxGain160",1,1,1,1,1,1,1,1,1,1,1,1,1,1,1,1,1,1,1,1,1,1,1,1,1,1,1,null,1,null,false,false,false,false,false,false,null,null,{"$f":"ROW()","v":41},null,null,null,null,null,null,null,null,null,null,null,null,null,null,null,null,null,null,null,null,null,null,null,null,null,null,null,null,null,null,null,null,null,null,null,null,null,null,null,null,null,null,null,null,null,null,null,null,null,null,null,null,null,null,null,19,"MaxGain160","In/Out door","In/Out door","In/Out door",null,null,41,0,0,41,41,null,"MaxGain160",1,0,0,0,0,0,1,0,0,0,0,0,"MaxGain160"]
["MaxGain200",0.22869999999999999,1.3210000000000001E-4,"N/A",{"$f":"((B42*SQRT($E$3*1000)+C42*$E$3*1000))/30480*Length*(1+'Cable Parameters'!I42/100*('Cable Parameters'!$E$1-25))+('Insertion Loss'!$F$16+'Insertion Loss'!$F$17)*SQRT($E$3)","v":0},18,150,-65,0.2,"http://www.eimfirst.co.il/wp-content/uploads/2018/09/Maxgain-Brochure-1.pdf",5,37,"MaxGain200",null,42,42,42,42,42,42,"MaxGain200",18,5,0,"N/A","In/Out door",31.75,null,"MaxGain200",1,1,1,1,1,1,1,1,1,1,1,1,1,1,1,1,1,1,1,1,1,1,1,1,1,1,1,null,1,null,false,false,false,false,false,false,null,null,{"$f":"ROW()","v":42},null,null,null,null,null,null,null,null,null,null,null,null,null,null,null,null,null,null,null,null,null,null,null,null,null,null,null,null,null,null,null,null,null,null,null,null,null,null,null,null,null,null,null,null,null,null,null,null,null,null,null,null,null,null,null,31.75,"MaxGain200","In/Out door","In/Out door","In/Out door",null,null,42,0,0,42,42,null,"MaxGain200",1,0,0,0,0,0,1,0,0,0,0,0,"MaxGain200"]
["MaxGain300",0.13256000000000001,1.259E-4,"N/A",{"$f":"((B43*SQRT($E$3*1000)+C43*$E$3*1000))/30480*Length*(1+'Cable Parameters'!I43/100*('Cable Parameters'!$E$1-25))+('Insertion Loss'!$F$16+'Insertion Loss'!$F$17)*SQRT($E$3)","v":0},18,150,-65,0.2,"http://www.eimfirst.co.il/wp-content/uploads/2018/09/Maxgain-Brochure-1.pdf",7.6,38,"MaxGain300",null,43,43,43,43,43,43,"MaxGain300",18,7.6,0,"N/A","In/Out door",44.45,null,"MaxGain300",1,1,1,1,1,1,1,1,1,1,1,1,1,1,1,1,1,1,1,1,1,1,1,1,1,1,1,null,1,null,false,false,false,false,false,false,null,null,{"$f":"ROW()","v":43},null,null,null,null,null,null,null,null,null,null,null,null,null,null,null,null,null,null,null,null,null,null,null,null,null,null,null,null,null,null,null,null,null,null,null,null,null,null,null,null,null,null,null,null,null,null,null,null,null,null,null,null,null,null,null,44.45,"MaxGain300","In/Out door","In/Out door","In/Out door",null,null,43,0,0,43,43,null,"MaxGain300",1,0,0,0,0,0,1,0,0,0,0,0,"MaxGain300"]
["MaxGain300S",0.17150000000000001,1.373E-4,"N/A",{"$f":"((B44*SQRT($E$3*1000)+C44*$E$3*1000))/30480*Length*(1+'Cable Parameters'!I44/100*('Cable Parameters'!$E$1-25))+('Insertion Loss'!$F$16+'Insertion Loss'!$F$17)*SQRT($E$3)","v":0},18,150,-65,0.2,"http://www.eimfirst.co.il/wp-content/uploads/2018/09/Maxgain-Brochure-1.pdf",7.6,39,"MaxGain300S",null,44,44,44,44,44,44,"MaxGain300S",18,7.6,0,"N/A","In/Out door",44.45,null,"MaxGain300S",1,1,1,1,1,1,1,1,1,1,1,1,1,1,1,1,1,1,1,1,1,1,1,1,1,1,1,null,1,null,false,false,false,false,false,false,null,null,{"$f":"ROW()","v":44},null,null,null,null,null,null,null,null,null,null,null,null,null,null,null,null,null,null,null,null,null,null,null,null,null,null,null,null,null,null,null,null,null,null,null,null,null,null,null,null,null,null,null,null,null,null,null,null,null,null,null,null,null,null,null,44.45,"MaxGain300S","In/Out door","In/Out door","In/Out door",null,null,44,0,0,44,44,null,"MaxGain300S",1,0,0,0,0,1,1,0,0,0,0,0,"MaxGain300S"]
["MilTech 160",0.42959999999999998,1.3410000000000001E-4,"N/A",{"$f":"((B45*SQRT($E$3*1000)+C45*$E$3*1000))/30480*Length*(1+'Cable Parameters'!I45/100*('Cable Parameters'!$E$1-25))+('Insertion Loss'!$F$16+'Insertion Loss'!$F$17)*SQRT($E$3)","v":0},40,150,-55,0.2,"http://www.eimfirst.co.il/wp-content/uploads/2018/07/MT160webC.pdf",4,40,"MilTech 160",null,45,45,45,45,45,45,"MilTech 160",40,4,0,"N/A","In/Out door",19.05,null,"MilTech 160",1,1,1,1,1,1,1,1,1,1,1,1,1,1,1,1,1,1,1,1,1,1,1,1,1,1,1,null,1,null,false,false,false,false,false,false,null,null,{"$f":"ROW()","v":45},null,null,null,null,null,null,null,null,null,null,null,null,null,null,null,null,null,null,null,null,null,null,null,null,null,null,null,null,null,null,null,null,null,null,null,null,null,null,null,null,null,null,null,null,null,null,null,null,null,null,null,null,null,null,null,19.05,"MilTech 160","In/Out door","In/Out door","In/Out door",null,null,45,0,0,45,45,null,"MilTech 160",1,0,1,0,0,1,1,0,0,1,0,0,"MilTech 160"]
["MilTech 210     ",0.33429999999999999,1.4999999999999999E-4,"N/A",{"$f":"((B46*SQRT($E$3*1000)+C46*$E$3*1000))/30480*Length*(1+'Cable Parameters'!I46/100*('Cable Parameters'!$E$1-25))+('Insertion Loss'!$F$16+'Insertion Loss'!$F$17)*SQRT($E$3)","v":0},18,150,-65,0.2,"http://www.eimfirst.co.il/wp-content/uploads/2018/07/MT210WEBB.pdf",5.3,41,"MilTech 210     ",null,46,46,46,46,46,46,"MilTech 210     ",18,5.3,0,"N/A","In/Out door",28.574999999999999,null,"MilTech 210     ",1,1,1,1,1,1,1,1,1,1,1,1,1,1,1,1,1,1,1,1,1,1,1,1,1,1,1,null,1,null,false,false,false,false,false,false,null,null,{"$f":"ROW()","v":46},null,null,null,null,null,null,null,null,null,null,null,null,null,null,null,null,null,null,null,null,null,null,null,null,null,null,null,null,null,null,null,null,null,null,null,null,null,null,null,null,null,null,null,null,null,null,null,null,null,null,null,null,null,null,null,28.574999999999999,"MilTech 210     ","In/Out door","In/Out door","In/Out door",null,null,46,0,0,46,46,null,"MilTech 210     ",1,0,1,0,0,1,1,0,0,1,0,0,"MilTech 210     "]
["MilTech 230",0.2462,1.3999999999999999E-4,"N/A",{"$f":"((B47*SQRT($E$3*1000)+C47*$E$3*1000))/30480*Length*(1+'Cable Parameters'!I47/100*('Cable Parameters'!$E$1-25))+('Insertion Loss'!$F$16+'Insertion Loss'!$F$17)*SQRT($E$3)","v":0},18,150,-65,0.2,"http://www.eimfirst.co.il/wp-content/uploads/2018/07/MT230WEBB.pdf",5.8,42,"MilTech 230",null,47,47,47,47,47,47,"MilTech 230",18,5.8,0,"N/A","In/Out door",28.574999999999999,null,"MilTech 230",1,1,1,1,1,1,1,1,1,1,1,1,1,1,1,1,1,1,1,1,1,1,1,1,1,1,1,null,1,null,false,false,false,false,false,false,null,null,{"$f":"ROW()","v":47},null,null,null,null,null,null,null,null,null,null,null,null,null,null,null,null,null,null,null,null,null,null,null,null,null,null,null,null,null,null,null,null,null,null,null,null,null,null,null,null,null,null,null,null,null,null,null,null,null,null,null,null,null,null,null,28.574999999999999,"MilTech 230","In/Out door","In/Out door","In/Out door",null,null,47,0,0,47,47,null,"MilTech 230",1,0,1,0,0,1,1,0,0,1,0,0,"MilTech 230"]
["MilTech 265",0.2147,1.4999999999999999E-4,"N/A",{"$f":"((B48*SQRT($E$3*1000)+C48*$E$3*1000))/30480*Length*(1+'Cable Parameters'!I48/100*('Cable Parameters'!$E$1-25))+('Insertion Loss'!$F$16+'Insertion Loss'!$F$17)*SQRT($E$3)","v":0},18,150,-65,0.2,"http://www.eimfirst.co.il/wp-content/uploads/2018/07/MT265WEBB.pdf",6.7,43,"MilTech 265",null,48,48,48,48,48,48,"MilTech 265",18,6.7,0,"N/A","In/Out door",33.32,null,"MilTech 265",1,1,1,1,1,1,1,1,1,1,1,1,1,1,1,1,1,1,1,1,1,1,1,1,1,1,1,null,1,null,false,false,false,false,false,false,null,null,{"$f":"ROW()","v":48},null,null,null,null,null,null,null,null,null,null,null,null,null,null,null,null,null,null,null,null,null,null,null,null,null,null,null,null,null,null,null,null,null,null,null,null,null,null,null,null,null,null,null,null,null,null,null,null,null,null,null,null,null,null,null,33.32,"MilTech 265","In/Out door","In/Out door","In/Out door",null,null,48,0,0,48,48,null,"MilTech 265",1,0,1,0,0,1,1,0,0,1,0,0,"MilTech 265"]
["MilTech 300",{"$f":" 0.1644","v":0.16439999999999999},1.4999999999999999E-4,"N/A",{"$f":"((B49*SQRT($E$3*1000)+C49*$E$3*1000))/30480*Length*(1+'Cable Parameters'!I49/100*('Cable Parameters'!$E$1-25))+('Insertion Loss'!$F$16+'Insertion Loss'!$F$17)*SQRT($E$3)","v":0},18,150,-65,0.2,"http://www.eimfirst.co.il/wp-content/uploads/2018/07/MT300webB.pdf",7.9,44,"MilTech 300",null,49,49,49,49,49,49,"MilTech 300",18,7.9,0,"N/A","In/Out door",44.45,null,"MilTech 300",1,1,1,1,1,1,1,1,1,1,1,1,1,1,1,1,1,1,1,1,1,1,1,1,1,1,1,null,1,null,false,false,false,false,false,false,null,null,{"$f":"ROW()","v":49},null,null,null,null,null,null,null,null,null,null,null,null,null,null,null,null,null,null,null,null,null,null,null,null,null,null,null,null,null,null,null,null,null,null,null,null,null,null,null,null,null,null,null,null,null,null,null,null,null,null,null,null,null,null,null,44.45,"MilTech 300","In/Out door","In/Out door","In/Out door",null,null,49,0,0,49,49,null,"MilTech 300",1,0,1,0,0,1,1,0,0,1,0,0,"MilTech 300"]
["MilTech 340",0.1414,1.3999999999999999E-4,"N/A",{"$f":"((B50*SQRT($E$3*1000)+C50*$E$3*1000))/30480*Length*(1+'Cable Parameters'!I50/100*('Cable Parameters'!$E$1-25))+('Insertion Loss'!$F$16+'Insertion Loss'!$F$17)*SQRT($E$3)","v":0},18,150,-65,0.2,"http://www.eimfirst.co.il/wp-content/uploads/2018/07/MT340webB.pdf",8.6,45,"MilTech 340",null,50,50,50,50,50,50,"MilTech 340",18,8.6,0,"N/A","In/Out door",44.45,null,"MilTech 340",1,1,1,1,1,1,1,1,1,1,1,1,1,1,1,1,1,1,1,1,1,1,1,1,1,1,1,null,1,null,false,false,false,false,false,false,null,null,{"$f":"ROW()","v":50},null,null,null,null,null,null,null,null,null,null,null,null,null,null,null,null,null,null,null,null,null,null,null,null,null,null,null,null,null,null,null,null,null,null,null,null,null,null,null,null,null,null,null,null,null,null,null,null,null,null,null,null,null,null,null,44.45,"MilTech 340","In/Out door","In/Out door","In/Out door",null,null,50,0,0,50,50,null,"MilTech 340",1,0,1,0,0,1,1,0,0,1,0,0,"MilTech 340"]
["MilTech 340EL",0.1414,1.3999999999999999E-4,"N/A",{"$f":"((B51*SQRT($E$3*1000)+C51*$E$3*1000))/30480*Length*(1+'Cable Parameters'!I51/100*('Cable Parameters'!$E$1-25))+('Insertion Loss'!$F$16+'Insertion Loss'!$F$17)*SQRT($E$3)","v":0},18,200,-55,0.2,"http://www.eimfirst.co.il/wp-content/uploads/2018/09/sorry.jpg",8.6,46,"MilTech 340EL",null,51,51,51,51,51,51,"MilTech 340EL",18,8.6,0,"N/A","In/Out door","N/A",null,"MilTech 340EL",1,1,1,1,1,1,1,1,1,1,1,1,1,1,1,1,1,1,1,1,1,1,1,1,1,1,1,null,1,null,false,false,false,false,false,false,null,null,{"$f":"ROW()","v":51},null,null,null,null,null,null,null,null,null,null,null,null,null,null,null,null,null,null,null,null,null,null,null,null,null,null,null,null,null,null,null,null,null,null,null,null,null,null,null,null,null,null,null,null,null,null,null,null,null,null,null,null,null,null,null,"N/A","MilTech 340EL","In/Out door","In/Out door","In/Out door",null,null,51,0,0,51,51,null,"MilTech 340EL",1,0,1,0,0,1,1,0,0,1,0,0,"MilTech 340EL"]
["MilTech 340XL",0.1414,1.3999999999999999E-4,"N/A",{"$f":"((B52*SQRT($E$3*1000)+C52*$E$3*1000))/30480*Length*(1+'Cable Parameters'!I52/100*('Cable Parameters'!$E$1-25))+('Insertion Loss'!$F$16+'Insertion Loss'!$F$17)*SQRT($E$3)","v":0},18,200,-55,0.2,"http://www.eimfirst.co.il/wp-content/uploads/2018/09/sorry.jpg",8.6,47,"MilTech 340XL",null,52,52,52,52,52,52,"MilTech 340XL",18,8.6,0,"N/A","In/Out door","N/A",null,"MilTech 340XL",1,1,1,1,1,1,1,1,1,1,1,1,1,1,1,1,1,1,1,1,1,1,1,1,1,1,1,null,1,null,false,false,false,false,false,false,null,null,{"$f":"ROW()","v":52},null,null,null,null,null,null,null,null,null,null,null,null,null,null,null,null,null,null,null,null,null,null,null,null,null,null,null,null,null,null,null,null,null,null,null,null,null,null,null,null,null,null,null,null,null,null,null,null,null,null,null,null,null,null,null,"N/A","MilTech 340XL","In/Out door","In/Out door","In/Out door",null,null,52,0,0,52,52,null,"MilTech 340XL",1,0,1,0,0,1,1,0,0,1,0,0,"MilTech 340XL"]
["MilTech 480",0.11360000000000001,1.4999999999999999E-4,"N/A",{"$f":"((B53*SQRT($E$3*1000)+C53*$E$3*1000))/30480*Length*(1+'Cable Parameters'!I53/100*('Cable Parameters'!$E$1-25))+('Insertion Loss'!$F$16+'Insertion Loss'!$F$17)*SQRT($E$3)","v":0},10,150,-65,0.2,"http://www.eimfirst.co.il/wp-content/uploads/2018/07/MT480webB.pdf",12.32,48,"MilTech 480",null,53,53,53,53,53,53,"MilTech 480",10,12.32,0,"N/A","In/Out door",60.32,null,"MilTech 480",1,1,1,1,1,1,1,1,1,1,1,1,1,1,1,1,1,1,1,1,1,1,1,1,1,1,1,null,1,null,false,false,false,false,false,false,null,null,{"$f":"ROW()","v":53},null,null,null,null,null,null,null,null,null,null,null,null,null,null,null,null,null,null,null,null,null,null,null,null,null,null,null,null,null,null,null,null,null,null,null,null,null,null,null,null,null,null,null,null,null,null,null,null,null,null,null,null,null,null,null,60.32,"MilTech 480","In/Out door","In/Out door","In/Out door",null,null,53,0,0,53,53,null,"MilTech 480",1,0,1,0,0,1,1,0,0,1,0,0,"MilTech 480"]
["MilTech 650",8.4349999999999994E-2,1.4440000000000001E-4,"N/A",{"$f":"((B54*SQRT($E$3*1000)+C54*$E$3*1000))/30480*Length*(1+'Cable Parameters'!I54/100*('Cable Parameters'!$E$1-25))+('Insertion Loss'!$F$16+'Insertion Loss'!$F$17)*SQRT($E$3)","v":0},8.5,150,-65,0.2,"http://www.eimfirst.co.il/wp-content/uploads/2018/07/MT650webB.pdf",16.64,49,"MilTech 650",null,54,54,54,54,54,54,"MilTech 650",8.5,16.64,0,"N/A","In/Out door",101.6,null,"MilTech 650",1,1,1,1,1,1,1,1,1,1,1,1,1,1,1,1,1,1,1,1,1,1,1,1,1,1,1,null,1,null,false,false,false,false,false,false,null,null,{"$f":"ROW()","v":54},null,null,null,null,null,null,null,null,null,null,null,null,null,null,null,null,null,null,null,null,null,null,null,null,null,null,null,null,null,null,null,null,null,null,null,null,null,null,null,null,null,null,null,null,null,null,null,null,null,null,null,null,null,null,null,101.6,"MilTech 650","In/Out door","In/Out door","In/Out door",null,null,54,0,0,54,54,null,"MilTech 650",1,0,1,0,0,1,1,0,0,1,0,0,"MilTech 650"]
["MilTech light MTL210",0.30719999999999997,1.2999999999999999E-4,"N/A",{"$f":"((B55*SQRT($E$3*1000)+C55*$E$3*1000))/30480*Length*(1+'Cable Parameters'!I55/100*('Cable Parameters'!$E$1-25))+('Insertion Loss'!$F$16+'Insertion Loss'!$F$17)*SQRT($E$3)","v":0},18,150,-65,0.2,"http://www.eimfirst.co.il/wp-content/uploads/2018/07/MTL210webB.pdf",5.3,50,"MilTech light MTL210",null,55,55,55,55,55,55,"MilTech light MTL210",18,5.3,0,"N/A","In/Out door",25.4,null,"MilTech light MTL210",1,1,1,1,1,1,1,1,1,1,1,1,1,1,1,1,1,1,1,1,1,1,1,1,1,1,1,null,1,null,false,false,false,false,false,false,null,null,{"$f":"ROW()","v":55},null,null,null,null,null,null,null,null,null,null,null,null,null,null,null,null,null,null,null,null,null,null,null,null,null,null,null,null,null,null,null,null,null,null,null,null,null,null,null,null,null,null,null,null,null,null,null,null,null,null,null,null,null,null,null,25.4,"MilTech light MTL210","In/Out door","In/Out door","In/Out door",null,null,55,0,0,55,55,null,"MilTech light MTL210",1,0,1,0,0,1,1,0,0,0,0,0,"MilTech light MTL210"]
["MilTech light MTL230",0.2462,1.2999999999999999E-4,"N/A",{"$f":"((B56*SQRT($E$3*1000)+C56*$E$3*1000))/30480*Length*(1+'Cable Parameters'!I56/100*('Cable Parameters'!$E$1-25))+('Insertion Loss'!$F$16+'Insertion Loss'!$F$17)*SQRT($E$3)","v":0},18,150,-65,0.2,"http://www.eimfirst.co.il/wp-content/uploads/2018/07/MTL230webB.pdf",5.8,51,"MilTech light MTL230",null,56,56,56,56,56,56,"MilTech light MTL230",18,5.8,0,"N/A","In/Out door",28.574999999999999,null,"MilTech light MTL230",1,1,1,1,1,1,1,1,1,1,1,1,1,1,1,1,1,1,1,1,1,1,1,1,1,1,1,null,1,null,false,false,false,false,false,false,null,null,{"$f":"ROW()","v":56},null,null,null,null,null,null,null,null,null,null,null,null,null,null,null,null,null,null,null,null,null,null,null,null,null,null,null,null,null,null,null,null,null,null,null,null,null,null,null,null,null,null,null,null,null,null,null,null,null,null,null,null,null,null,null,28.574999999999999,"MilTech light MTL230","In/Out door","In/Out door","In/Out door",null,null,56,0,0,56,56,null,"MilTech light MTL230",1,0,1,0,0,1,1,0,0,0,0,0,"MilTech light MTL230"]
["MilTech light MTL270",0.19009999999999999,1.2999999999999999E-4,"N/A",{"$f":"((B57*SQRT($E$3*1000)+C57*$E$3*1000))/30480*Length*(1+'Cable Parameters'!I57/100*('Cable Parameters'!$E$1-25))+('Insertion Loss'!$F$16+'Insertion Loss'!$F$17)*SQRT($E$3)","v":0},18,150,-65,0.2,"http://www.eimfirst.co.il/wp-content/uploads/2018/07/MTL270webB.pdf",6.9,52,"MilTech light MTL270",null,57,57,57,57,57,57,"MilTech light MTL270",18,6.9,0,"N/A","In/Out door",31.75,null,"MilTech light MTL270",1,1,1,1,1,1,1,1,1,1,1,1,1,1,1,1,1,1,1,1,1,1,1,1,1,1,1,null,1,null,false,false,false,false,false,false,null,null,{"$f":"ROW()","v":57},null,null,null,null,null,null,null,null,null,null,null,null,null,null,null,null,null,null,null,null,null,null,null,null,null,null,null,null,null,null,null,null,null,null,null,null,null,null,null,null,null,null,null,null,null,null,null,null,null,null,null,null,null,null,null,31.75,"MilTech light MTL270","In/Out door","In/Out door","In/Out door",null,null,57,0,0,57,57,null,"MilTech light MTL270",1,0,1,0,0,1,1,0,0,0,0,0,"MilTech light MTL270"]
["MilTech light MTL330",0.1414,1.3999999999999999E-4,"N/A",{"$f":"((B58*SQRT($E$3*1000)+C58*$E$3*1000))/30480*Length*(1+'Cable Parameters'!I58/100*('Cable Parameters'!$E$1-25))+('Insertion Loss'!$F$16+'Insertion Loss'!$F$17)*SQRT($E$3)","v":0},18,150,-65,0.2,"http://www.eimfirst.co.il/wp-content/uploads/2018/07/MTL330webB.pdf",8.6,53,"MilTech light MTL330",null,58,58,58,58,58,58,"MilTech light MTL330",18,8.6,0,"N/A","In/Out door",44.45,null,"MilTech light MTL330",1,1,1,1,1,1,1,1,1,1,1,1,1,1,1,1,1,1,1,1,1,1,1,1,1,1,1,null,1,null,false,false,false,false,false,false,null,null,{"$f":"ROW()","v":58},null,null,null,null,null,null,null,null,null,null,null,null,null,null,null,null,null,null,null,null,null,null,null,null,null,null,null,null,null,null,null,null,null,null,null,null,null,null,null,null,null,null,null,null,null,null,null,null,null,null,null,null,null,null,null,44.45,"MilTech light MTL330","In/Out door","In/Out door","In/Out door",null,null,58,0,0,58,58,null,"MilTech light MTL330",1,0,1,0,0,1,1,0,0,0,0,0,"MilTech light MTL330"]
["MilTech light MTL440",0.1118,1.4999999999999999E-4,"N/A",{"$f":"((B59*SQRT($E$3*1000)+C59*$E$3*1000))/30480*Length*(1+'Cable Parameters'!I59/100*('Cable Parameters'!$E$1-25))+('Insertion Loss'!$F$16+'Insertion Loss'!$F$17)*SQRT($E$3)","v":0},12,150,-65,0.2,"http://www.eimfirst.co.il/wp-content/uploads/2018/07/MTL440webB.pdf",11,54,"MilTech light MTL440",null,59,59,59,59,59,59,"MilTech light MTL440",12,11,0,"N/A","In/Out door",63.5,null,"MilTech light MTL440",1,1,1,1,1,1,1,1,1,1,1,1,1,1,1,1,1,1,1,1,1,1,1,1,1,1,1,null,1,null,false,false,false,false,false,false,null,null,{"$f":"ROW()","v":59},null,null,null,null,null,null,null,null,null,null,null,null,null,null,null,null,null,null,null,null,null,null,null,null,null,null,null,null,null,null,null,null,null,null,null,null,null,null,null,null,null,null,null,null,null,null,null,null,null,null,null,null,null,null,null,63.5,"MilTech light MTL440","In/Out door","In/Out door","In/Out door",null,null,59,0,0,59,59,null,"MilTech light MTL440",1,0,1,0,0,1,1,0,0,0,0,0,"MilTech light MTL440"]
["MilTech 340-LS/ZHAL ",0.1414,1.3999999999999999E-4,"N/A",{"$f":"((B60*SQRT($E$3*1000)+C60*$E$3*1000))/30480*Length*(1+'Cable Parameters'!I60/100*('Cable Parameters'!$E$1-25))+('Insertion Loss'!$F$16+'Insertion Loss'!$F$17)*SQRT($E$3)","v":0},18,85,-30,0.2,"http://www.eimfirst.co.il/wp-content/uploads/2018/09/MT340LS.pdf",8.8000000000000007,55,"MilTech 340-LS/ZHAL ",null,60,60,60,60,60,60,"MilTech 340-LS/ZHAL ",18,8.8000000000000007,0,"N/A","In/Out door",44.45,null,"MilTech 340-LS/ZHAL ",1,1,1,1,1,1,1,1,1,1,1,1,1,1,1,1,1,1,1,1,1,1,1,1,1,1,1,null,1,null,false,false,false,false,false,false,null,null,{"$f":"ROW()","v":60},null,null,null,null,null,null,null,null,null,null,null,null,null,null,null,null,null,null,null,null,null,null,null,null,null,null,null,null,null,null,null,null,null,null,null,null,null,null,null,null,null,null,null,null,null,null,null,null,null,null,null,null,null,null,null,44.45,"MilTech 340-LS/ZHAL ","In/Out door","In/Out door","In/Out door",null,null,60,0,0,60,60,null,"MilTech 340-LS/ZHAL ",1,0,1,0,0,1,1,0,0,0,0,0,"MilTech 340-LS/ZHAL "]
["PhaseTrack   SR PTSRB047",1.17249,9.1750999999999996E-4,"N/A",{"$f":"((B61*SQRT($E$3*1000)+C61*$E$3*1000))/30480*Length*(1+'Cable Parameters'!I61/100*('Cable Parameters'!$E$1-25))+('Insertion Loss'!$F$16+'Insertion Loss'!$F$17)*SQRT($E$3)","v":0},138.5,125,-55,0.2,"http://www.eimfirst.co.il/wp-content/uploads/2018/09/ptsrb047-141.pdf",1.19,56,"PhaseTrack   SR PTSRB047",null,61,61,61,61,61,61,"PhaseTrack   SR PTSRB047",138.5,1.19,0,"N/A","In/Out door",3.81,null,"PhaseTrack   SR PTSRB047",1,1,1,1,1,1,1,1,1,1,1,1,1,1,1,1,1,1,1,1,1,1,1,1,1,1,1,null,1,null,false,false,false,false,false,false,null,null,{"$f":"ROW()","v":61},null,null,null,null,null,null,null,null,null,null,0.01,0.1356,0.03,0.05,0.1,0.15,0.4,0.45,0.5,0.9,1,1.5,1.8,2,2.5,3,4,5,5.8,6,8,10,11,12,13.5,15,16,18,24,26.5,28,35,40,50,63,65,90,null,null,null,null,null,null,null,null,3.81,"PhaseTrack   SR PTSRB047","In/Out door","In/Out door","In/Out door",null,null,61,0,0,61,61,null,"PhaseTrack   SR PTSRB047",1,1,0,0,1,1,1,1,0,0,0,0,"PhaseTrack   SR PTSRB047"]
["PhaseTrack   SR PTSRB085",0.63712000000000002,9.6759999999999999E-4,"N/A",{"$f":"((B62*SQRT($E$3*1000)+C62*$E$3*1000))/30480*Length*(1+'Cable Parameters'!I62/100*('Cable Parameters'!$E$1-25))+('Insertion Loss'!$F$16+'Insertion Loss'!$F$17)*SQRT($E$3)","v":0},80.2,125,-55,0.2,"http://www.eimfirst.co.il/wp-content/uploads/2018/09/ptsrb047-141.pdf",2.16,57,"PhaseTrack   SR PTSRB085",null,62,62,62,62,62,62,"PhaseTrack   SR PTSRB085",80.2,2.16,0,"N/A","In/Out door",6.35,null,"PhaseTrack   SR PTSRB085",1,1,1,1,1,1,1,1,1,1,1,1,1,1,1,1,1,1,1,1,1,1,1,1,1,1,1,null,1,null,false,false,false,false,false,false,null,null,{"$f":"ROW()","v":62},null,null,null,null,null,null,null,null,null,null,null,null,null,null,null,null,null,null,null,null,null,null,null,null,null,null,null,null,null,null,null,null,null,null,null,null,null,null,null,null,null,null,null,null,null,null,null,null,null,null,null,null,null,null,null,6.35,"PhaseTrack   SR PTSRB085","In/Out door","In/Out door","In/Out door",null,null,62,0,0,62,62,null,"PhaseTrack   SR PTSRB085",1,1,0,0,1,1,1,1,0,0,0,0,"PhaseTrack   SR PTSRB085"]
["PhaseTrack   SR PTSRB141",0.30381999999999998,7.7835999999999997E-4,"N/A",{"$f":"((B63*SQRT($E$3*1000)+C63*$E$3*1000))/30480*Length*(1+'Cable Parameters'!I63/100*('Cable Parameters'!$E$1-25))+('Insertion Loss'!$F$16+'Insertion Loss'!$F$17)*SQRT($E$3)","v":0},38.4,125,-55,0.2,"http://www.eimfirst.co.il/wp-content/uploads/2018/09/ptsrb047-141.pdf",3.58,58,"PhaseTrack   SR PTSRB141",null,63,63,63,63,63,63,"PhaseTrack   SR PTSRB141",38.4,3.58,0,"N/A","In/Out door",10.795,null,"PhaseTrack   SR PTSRB141",1,1,1,1,1,1,1,1,1,1,1,1,1,1,1,1,1,1,1,1,1,1,1,1,1,1,1,null,1,null,false,false,false,false,false,false,null,null,{"$f":"ROW()","v":63},null,null,null,null,null,null,null,null,null,null,null,null,null,null,null,null,null,null,null,null,null,null,null,null,null,null,null,null,null,null,null,null,null,null,null,null,null,null,null,null,null,null,null,null,null,null,null,null,null,null,null,null,null,null,null,10.795,"PhaseTrack   SR PTSRB141","In/Out door","In/Out door","In/Out door",null,null,63,0,0,63,63,null,"PhaseTrack   SR PTSRB141",1,1,0,0,1,1,1,1,0,0,0,0,"PhaseTrack   SR PTSRB141"]
["PhaseTrack  PF 047",1.2448699999999999,1.0516E-3,"N/A",{"$f":"((B64*SQRT($E$3*1000)+C64*$E$3*1000))/30480*Length*(1+'Cable Parameters'!I64/100*('Cable Parameters'!$E$1-25))+('Insertion Loss'!$F$16+'Insertion Loss'!$F$17)*SQRT($E$3)","v":0},142.30000000000001,125,-55,0.2,"http://www.eimfirst.co.il/wp-content/uploads/2018/09/pf047-402.pdf",1.62,59,"PhaseTrack  PF 047",null,64,64,64,64,64,64,"PhaseTrack  PF 047",142.30000000000001,1.62,0,"N/A","In/Out door",6.35,null,"PhaseTrack  PF 047",1,1,1,1,1,1,1,1,1,1,1,1,1,1,1,1,1,1,1,1,1,1,1,1,1,1,1,null,1,null,false,false,false,false,false,false,null,null,{"$f":"ROW()","v":64},null,null,null,null,null,null,null,null,null,null,null,null,null,null,null,null,null,null,null,null,null,null,null,null,null,null,null,null,null,null,null,null,null,null,null,null,null,null,null,null,null,null,null,null,null,null,null,null,null,null,null,null,null,null,null,6.35,"PhaseTrack  PF 047","In/Out door","In/Out door","In/Out door",null,null,64,0,0,64,64,null,"PhaseTrack  PF 047",1,1,1,0,0,1,1,1,0,0,0,0,"PhaseTrack  PF 047"]
["PhaseTrack  PF 130",0.43042999999999998,7.6999999999999996E-4,"N/A",{"$f":"((B65*SQRT($E$3*1000)+C65*$E$3*1000))/30480*Length*(1+'Cable Parameters'!I65/100*('Cable Parameters'!$E$1-25))+('Insertion Loss'!$F$16+'Insertion Loss'!$F$17)*SQRT($E$3)","v":0},52.3,125,-55,0.2,"http://www.eimfirst.co.il/wp-content/uploads/2018/09/pf047-402.pdf",3.3,60,"PhaseTrack  PF 130",null,65,65,65,65,65,65,"PhaseTrack  PF 130",52.3,3.3,0,"N/A","In/Out door",15.875,null,"PhaseTrack  PF 130",1,1,1,1,1,1,1,1,1,1,1,1,1,1,1,1,1,1,1,1,1,1,1,1,1,1,1,null,1,null,false,false,false,false,false,false,null,null,{"$f":"ROW()","v":65},null,null,null,null,null,null,null,null,null,null,null,null,null,null,null,null,null,null,null,null,null,null,null,null,null,null,null,null,null,null,null,null,null,null,null,null,null,null,null,null,null,null,null,null,null,null,null,null,null,null,null,null,null,null,null,15.875,"PhaseTrack  PF 130","In/Out door","In/Out door","In/Out door",null,null,65,0,0,65,65,null,"PhaseTrack  PF 130",1,1,1,0,0,1,1,1,0,0,0,0,"PhaseTrack  PF 130"]
["PhaseTrack  PF 402",0.33989999999999998,7.6449999999999999E-4,"N/A",{"$f":"((B66*SQRT($E$3*1000)+C66*$E$3*1000))/30480*Length*(1+'Cable Parameters'!I66/100*('Cable Parameters'!$E$1-25))+('Insertion Loss'!$F$16+'Insertion Loss'!$F$17)*SQRT($E$3)","v":0},38.700000000000003,125,-55,0.2,"http://www.eimfirst.co.il/wp-content/uploads/2018/09/pf047-402.pdf",4,61,"PhaseTrack  PF 402",null,66,66,66,66,66,66,"PhaseTrack  PF 402",38.700000000000003,4,0,"N/A","In/Out door",19.05,null,"PhaseTrack  PF 402",1,1,1,1,1,1,1,1,1,1,1,1,1,1,1,1,1,1,1,1,1,1,1,1,1,1,1,null,1,null,false,false,false,false,false,false,null,null,{"$f":"ROW()","v":66},null,null,null,null,null,null,null,null,null,null,null,null,null,null,null,null,null,null,null,null,null,null,null,null,null,null,null,null,null,null,null,null,null,null,null,null,null,null,null,null,null,null,null,null,null,null,null,null,null,null,null,null,null,null,null,19.05,"PhaseTrack  PF 402","In/Out door","In/Out door","In/Out door",null,null,66,0,0,66,66,null,"PhaseTrack  PF 402",1,1,1,0,0,1,1,1,0,0,0,0,"PhaseTrack  PF 402"]
["PhaseTrack  PF 405",0.69101999999999997,9.6969999999999999E-4,"N/A",{"$f":"((B67*SQRT($E$3*1000)+C67*$E$3*1000))/30480*Length*(1+'Cable Parameters'!I67/100*('Cable Parameters'!$E$1-25))+('Insertion Loss'!$F$16+'Insertion Loss'!$F$17)*SQRT($E$3)","v":0},79.900000000000006,125,-55,0.2,"http://www.eimfirst.co.il/wp-content/uploads/2018/09/pf047-402.pdf",2.38,62,"PhaseTrack  PF 405",null,67,67,67,67,67,67,"PhaseTrack  PF 405",79.900000000000006,2.38,0,"N/A","In/Out door",12.7,null,"PhaseTrack  PF 405",1,1,1,1,1,1,1,1,1,1,1,1,1,1,1,1,1,1,1,1,1,1,1,1,1,1,1,null,1,null,false,false,false,false,false,false,null,null,{"$f":"ROW()","v":67},null,null,null,null,null,null,null,null,null,null,null,null,null,null,null,null,null,null,null,null,null,null,null,null,null,null,null,null,null,null,null,null,null,null,null,null,null,null,null,null,null,null,null,null,null,null,null,null,null,null,null,null,null,null,null,12.7,"PhaseTrack  PF 405","In/Out door","In/Out door","In/Out door",null,null,67,0,0,67,67,null,"PhaseTrack  PF 405",1,1,1,0,0,1,1,1,0,0,0,0,"PhaseTrack  PF 405"]
["PhaseTrack  PT 318",0.15565000000000001,7.6725000000000003E-4,"N/A",{"$f":"((B68*SQRT($E$3*1000)+C68*$E$3*1000))/30480*Length*(1+'Cable Parameters'!I68/100*('Cable Parameters'!$E$1-25))+('Insertion Loss'!$F$16+'Insertion Loss'!$F$17)*SQRT($E$3)","v":0},18.899999999999999,150,-55,0.2,"http://www.eimfirst.co.il/wp-content/uploads/2018/09/pt11o-318.pdf",8,63,"PhaseTrack  PT 318",null,68,68,68,68,68,68,"PhaseTrack  PT 318",18.899999999999999,8,0,"N/A","In/Out door",44.45,null,"PhaseTrack  PT 318",1,1,1,1,1,1,1,1,1,1,1,1,1,1,1,1,1,1,1,1,1,1,1,1,1,1,1,null,1,null,false,false,false,false,false,false,null,null,{"$f":"ROW()","v":68},null,null,null,null,null,null,null,null,null,null,null,null,null,null,null,null,null,null,null,null,null,null,null,null,null,null,null,null,null,null,null,null,null,null,null,null,null,null,null,null,null,null,null,null,null,null,null,null,null,null,null,null,null,null,null,44.45,"PhaseTrack  PT 318","In/Out door","In/Out door","In/Out door",null,null,68,0,0,68,68,null,"PhaseTrack  PT 318",1,1,0,0,0,1,0,1,0,0,0,0,"PhaseTrack  PT 318"]
["PhaseTrack  PT110",0.72391000000000005,1.3239E-3,"N/A",{"$f":"((B69*SQRT($E$3*1000)+C69*$E$3*1000))/30480*Length*(1+'Cable Parameters'!I69/100*('Cable Parameters'!$E$1-25))+('Insertion Loss'!$F$16+'Insertion Loss'!$F$17)*SQRT($E$3)","v":0},80,150,-55,0.2,"http://www.eimfirst.co.il/wp-content/uploads/2018/09/pt11o-318.pdf",2.74,64,"PhaseTrack  PT110",null,69,69,69,69,69,69,"PhaseTrack  PT110",80,2.74,0,"N/A","In/Out door",13.97,null,"PhaseTrack  PT110",1,1,1,1,1,1,1,1,1,1,1,1,1,1,1,1,1,1,1,1,1,1,1,1,1,1,1,null,1,null,false,false,false,false,false,false,null,null,{"$f":"ROW()","v":69},null,null,null,null,null,null,null,null,null,null,null,null,null,null,null,null,null,null,null,null,null,null,null,null,null,null,null,null,null,null,null,null,null,null,null,null,null,null,null,null,null,null,null,null,null,null,null,null,null,null,null,null,null,null,null,13.97,"PhaseTrack  PT110","In/Out door","In/Out door","In/Out door",null,null,69,0,0,69,69,null,"PhaseTrack  PT110",1,1,0,0,0,1,0,1,0,0,0,0,"PhaseTrack  PT110"]
["PhaseTrack  PT130",0.45319999999999999,5.5604999999999999E-4,"N/A",{"$f":"((B70*SQRT($E$3*1000)+C70*$E$3*1000))/30480*Length*(1+'Cable Parameters'!I70/100*('Cable Parameters'!$E$1-25))+('Insertion Loss'!$F$16+'Insertion Loss'!$F$17)*SQRT($E$3)","v":0},52.4,150,-55,0.2,"https://www.eimfirst.co.il/wp-content/uploads/2018/07/PhaseTrack_Brochure.pdf",3.68,65,"PhaseTrack  PT130",null,70,{"$f":"IF(O70=\"\",\"\",IF($P$2=\"\",O70,IF(OR(INDEX(A:M,ROW(),6)=$P$2,INDEX(A:M,ROW(),6)>$P$2),ROW(),\"\")))","v":70},{"$f":"IF(P70=\"\",\"\",IF($Q$2=\"\",P70,IF(INDEX(DV:DW,ROW(),$Q$2)=\"\",\"\",ROW())))","v":70},{"$f":"IF(Q70=\"\",\"\",IF($R$2=\"\",Q70,IF(OR(INDEX(A:WQ,ROW(),4)=$R$2,INDEX(A:WQ,ROW(),4)>$R$2),ROW(),\"\")))","v":70},{"$f":"IF(R70=\"\",\"\",IF($S$2=\"\",R70,IF(OR(INDEX(A:N,ROW(),11)>$S$2+1,INDEX(A:N,ROW(),11)<$S$2-1),\"\",ROW())))","v":70},{"$f":"EE70","v":70},{"$f":"IF(T70=\"\",\"\",INDEX(A:M,T70,1))","v":"PhaseTrack  PT130"},{"$f":"IF(T70=\"\",\"\",INDEX(A:N,T70,6))","v":52.4},{"$f":"IF(T70=\"\",\"\",INDEX(A:O,T70,11))","v":3.68},{"$f":"IF(T70=\"\",\"\",INDEX(A:P,T70,5))","v":0},{"$f":"IF(T70=\"\",\"\",INDEX(A:R,T70,4))","v":"N/A"},{"$f":"IF(ISERROR(IF($Q$2=\"\",INDEX(A:WQ,T70,128),IF($Q$2=1,INDEX(A:WQ,T70,126),INDEX(A:WQ,T70,127)))),\"\",IF($Q$2=\"\",INDEX(A:WQ,T70,128),IF($Q$2=1,INDEX(A:WQ,T70,126),INDEX(A:WQ,T70,127))))","v":"In/Out door"},{"$f":"IF(T70=\"\",\"\",INDEX(A:WQ,T70,124))","v":19.05},null,"PhaseTrack  PT130",1,1,1,1,1,1,1,1,1,1,1,1,1,1,1,1,1,1,1,1,1,1,1,1,1,1,1,null,1,null,{"$f":"OR(AND(AD70=0,AE70=0,AF70=0,AG70=0,AH70=0),BF70=0)","v":false},{"$f":"OR(AND(AI70=0,AJ70=0,AK70=0,AL70=0,AM70=0),BF70=0)","v":false},{"$f":"OR(AND(AN70=0,AO70=0,AP70=0,AQ70=0,AR70=0),BF70=0)","v":false},{"$f":"OR(AND(AS70=0,AT70=0,AU70=0,AV70=0,AW70=0),BF70=0)","v":false},{"$f":"OR(AND(AX70=0,AY70=0,AZ70=0,BA70=0,BB70=0),BF70=0)","v":false},{"$f":"OR(AND(BC70=0,BD70=0),BF70=0)","v":false},null,null,{"$f":"ROW()","v":70},null,null,null,null,null,null,null,null,null,null,null,null,null,null,null,null,null,null,null,null,null,null,null,null,null,null,null,null,null,null,null,null,null,null,null,null,null,null,null,null,null,null,null,null,null,null,null,null,null,null,null,null,null,null,null,19.05,"PhaseTrack  PT130","In/Out door","In/Out door",{"$f":"DV70","v":"In/Out door"},null,null,70,0,0,70,70,null,"PhaseTrack  PT130",1,1,0,0,0,1,0,1,0,0,0,0,"PhaseTrack  PT130"]
["PhaseTrack  PT150",0.45319999999999999,5.5604999999999999E-4,"N/A",{"$f":"((B71*SQRT($E$3*1000)+C71*$E$3*1000))/30480*Length*(1+'Cable Parameters'!I71/100*('Cable Parameters'!$E$1-25))+('Insertion Loss'!$F$16+'Insertion Loss'!$F$17)*SQRT($E$3)","v":0},52.4,150,-55,0.2,"http://www.eimfirst.co.il/wp-content/uploads/2018/09/pt11o-318.pdf",3.68,66,{"$f":"ET71","v":"PhaseTrack  PT150"},null,{"$f":"IF(M71=\"\",\"\",     IF($M$4=0,ROW(), IF(ISERROR(FIND($N$4,UPPER(A71))),\"\",ROW())))","v":71},{"$f":"IF(O71=\"\",\"\",IF($P$2=\"\",O71,IF(OR(INDEX(A:M,ROW(),6)=$P$2,INDEX(A:M,ROW(),6)>$P$2),ROW(),\"\")))","v":71},{"$f":"IF(P71=\"\",\"\",IF($Q$2=\"\",P71,IF(INDEX(DV:DW,ROW(),$Q$2)=\"\",\"\",ROW())))","v":71},71,{"$f":"IF(R71=\"\",\"\",IF($S$2=\"\",R71,IF(OR(INDEX(A:N,ROW(),11)>$S$2+1,INDEX(A:N,ROW(),11)<$S$2-1),\"\",ROW())))","v":71},71,{"$f":"IF(T71=\"\",\"\",INDEX(A:M,T71,1))","v":"PhaseTrack  PT150"},{"$f":"IF(T71=\"\",\"\",INDEX(A:N,T71,6))","v":52.4},{"$f":"IF(T71=\"\",\"\",INDEX(A:O,T71,11))","v":3.68},{"$f":"IF(T71=\"\",\"\",INDEX(A:P,T71,5))","v":0},{"$f":"IF(T71=\"\",\"\",INDEX(A:R,T71,4))","v":"N/A"},"In/Out door",19.05,null,{"$f":"A71","v":"PhaseTrack  PT150"},1,1,1,1,1,1,1,1,1,1,1,1,1,1,1,1,1,1,1,1,1,1,1,1,1,1,1,null,1,null,false,false,false,false,false,false,null,null,{"$f":"ROW()","v":71},null,null,null,null,null,null,null,null,null,null,null,null,null,null,null,null,null,null,null,null,null,null,null,null,null,null,null,null,null,null,null,null,null,null,null,null,null,null,null,null,null,null,null,null,null,null,null,null,null,null,null,null,null,null,null,19.05,"PhaseTrack  PT150","In/Out door","In/Out door","In/Out door",null,null,{"$f":"IF(ISERROR(SMALL($S$6:$S$250,$L71)),\"\",SMALL($S$6:$S$250,$L71))","v":71},{"$f":"IF($EA71=\"\",\"\",IF(ISERROR(INDEX(A:EE,EA71,5)),EA71,INDEX(A:EE,EA71,5)))","v":0},{"$f":"IF(ISERROR(SMALL($EB$6:$EB$250,$L71)),\"\",SMALL($EB$6:$EB$250,$L71))","v":0},{"$f":"EA71","v":71},{"$f":"IF($P$2=\"\",EA71,VLOOKUP(EC71,$EB:$EE,3,FALSE))","v":71},null,{"$f":"A71","v":"PhaseTrack  PT150"},1,1,0,0,0,1,0,1,0,0,0,0,{"$f":"IF($ET$3=\"\",INDEX($A:$ES,ROW(),137),IF(INDEX($A:$ES,ROW(),$ET$3)=1,INDEX($A:$ES,ROW(),137),\"\"))","v":"PhaseTrack  PT150"}]
["PhaseTrack  PT180",0.33627000000000001,7.4129000000000003E-4,"N/A",{"$f":"((B72*SQRT($E$3*1000)+C72*$E$3*1000))/30480*Length*(1+'Cable Parameters'!I72/100*('Cable Parameters'!$E$1-25))+('Insertion Loss'!$F$16+'Insertion Loss'!$F$17)*SQRT($E$3)","v":0},38.700000000000003,150,-55,0.2,"http://www.eimfirst.co.il/wp-content/uploads/2018/09/pt11o-318.pdf",4.57,67,"PhaseTrack  PT180",null,72,72,72,72,72,{"$f":"EE72","v":72},"PhaseTrack  PT180",38.700000000000003,4.57,0,"N/A","In/Out door",25.4,null,"PhaseTrack  PT180",1,1,1,1,1,1,1,1,1,1,1,1,1,1,1,1,1,1,1,1,1,1,1,1,1,1,1,null,1,null,{"$f":"OR(AND(AD72=0,AE72=0,AF72=0,AG72=0,AH72=0),BF72=0)","v":false},{"$f":"OR(AND(AI72=0,AJ72=0,AK72=0,AL72=0,AM72=0),BF72=0)","v":false},{"$f":"OR(AND(AN72=0,AO72=0,AP72=0,AQ72=0,AR72=0),BF72=0)","v":false},{"$f":"OR(AND(AS72=0,AT72=0,AU72=0,AV72=0,AW72=0),BF72=0)","v":false},{"$f":"OR(AND(AX72=0,AY72=0,AZ72=0,BA72=0,BB72=0),BF72=0)","v":false},{"$f":"OR(AND(BC72=0,BD72=0),BF72=0)","v":false},null,null,{"$f":"ROW()","v":72},null,null,null,null,null,null,null,null,null,null,null,null,null,null,null,null,null,null,null,null,null,null,null,null,null,null,null,null,null,null,null,null,null,null,null,null,null,null,null,null,null,null,null,null,null,null,null,null,null,null,null,null,null,null,null,25.4,{"$f":"A72","v":"PhaseTrack  PT180"},"In/Out door","In/Out door",{"$f":"DV72","v":"In/Out door"},null,null,72,0,0,72,72,null,"PhaseTrack  PT180",1,1,0,0,0,1,0,1,0,0,0,0,"PhaseTrack  PT180"]
["PhaseTrack  PT210",0.25971,7.5526E-4,"N/A",{"$f":"((B73*SQRT($E$3*1000)+C73*$E$3*1000))/30480*Length*(1+'Cable Parameters'!I73/100*('Cable Parameters'!$E$1-25))+('Insertion Loss'!$F$16+'Insertion Loss'!$F$17)*SQRT($E$3)","v":0},29,150,-55,0.2,"http://www.eimfirst.co.il/wp-content/uploads/2018/09/pt11o-318.pdf",5.58,68,"PhaseTrack  PT210",null,73,73,73,73,73,73,"PhaseTrack  PT210",29,5.58,0,"N/A","In/Out door",28.574999999999999,null,"PhaseTrack  PT210",1,1,1,1,1,1,1,1,1,1,1,1,1,1,1,1,1,1,1,1,1,1,1,1,1,1,1,null,1,null,false,false,false,false,false,false,null,null,{"$f":"ROW()","v":73},null,null,null,null,null,null,null,null,null,null,null,null,null,null,null,null,null,null,null,null,null,null,null,null,null,null,null,null,null,null,null,null,null,null,null,null,null,null,null,null,null,null,null,null,null,null,null,null,null,null,null,null,null,null,null,28.574999999999999,"PhaseTrack  PT210","In/Out door","In/Out door","In/Out door",null,null,73,0,0,73,73,null,"PhaseTrack  PT210",1,1,0,0,0,1,0,1,0,0,0,0,"PhaseTrack  PT210"]
["PhaseTrack  PTLS 400",0.15013799999999999,2.6200000000000003E-4,"N/A",{"$f":"((B74*SQRT($E$3*1000)+C74*$E$3*1000))/30480*Length*(1+'Cable Parameters'!I74/100*('Cable Parameters'!$E$1-25))+('Insertion Loss'!$F$16+'Insertion Loss'!$F$17)*SQRT($E$3)","v":0},16.2,85,-40,0.2,"http://www.eimfirst.co.il/wp-content/uploads/2018/09/ptls400-600.pdf",10.16,69,"PhaseTrack  PTLS 400",null,74,74,74,74,74,74,"PhaseTrack  PTLS 400",16.2,10.16,0,"N/A","In/Out door",101.6,null,"PhaseTrack  PTLS 400",1,1,1,1,1,1,1,1,1,1,1,1,1,1,1,1,1,1,1,1,1,1,1,1,1,1,1,null,1,null,false,false,false,false,false,false,null,null,{"$f":"ROW()","v":74},null,null,null,null,null,null,null,null,null,null,null,null,null,null,null,null,null,null,null,null,null,null,null,null,null,null,null,null,null,null,null,null,null,null,null,null,null,null,null,null,null,null,null,null,null,null,null,null,null,null,null,null,null,null,null,101.6,"PhaseTrack  PTLS 400","In/Out door","In/Out door","In/Out door",null,null,74,0,0,74,74,null,"PhaseTrack  PTLS 400",1,1,1,0,0,1,1,1,0,0,0,0,"PhaseTrack  PTLS 400"]
["PhaseTrack  PTLS 600",9.2086000000000001E-2,2.5599999999999999E-4,"N/A",{"$f":"((B75*SQRT($E$3*1000)+C75*$E$3*1000))/30480*Length*(1+'Cable Parameters'!I75/100*('Cable Parameters'!$E$1-25))+('Insertion Loss'!$F$16+'Insertion Loss'!$F$17)*SQRT($E$3)","v":0},10,85,-40,0.2,"http://www.eimfirst.co.il/wp-content/uploads/2018/09/ptls400-600.pdf",15.24,70,"PhaseTrack  PTLS 600",null,75,75,75,75,75,75,"PhaseTrack  PTLS 600",10,15.24,0,"N/A","In/Out door",152.4,null,"PhaseTrack  PTLS 600",1,1,1,1,1,1,1,1,1,1,1,1,1,1,1,1,1,1,1,1,1,1,1,1,1,1,1,null,1,null,false,false,false,false,false,false,null,null,{"$f":"ROW()","v":75},null,null,null,null,null,null,null,null,null,null,null,null,null,null,null,null,null,null,null,null,null,null,null,null,null,null,null,null,null,null,null,null,null,null,null,null,null,null,null,null,null,null,null,null,null,null,null,null,null,null,null,null,null,null,null,152.4,"PhaseTrack  PTLS 600","In/Out door","In/Out door","In/Out door",null,null,75,0,0,75,75,null,"PhaseTrack  PTLS 600",1,1,1,0,0,1,1,1,0,0,0,0,"PhaseTrack  PTLS 600"]
["SiO2-090",0.43955699999999998,1.1999999999999999E-3,"N/A",{"$f":"((B76*SQRT($E$3*1000)+C76*$E$3*1000))/30480*Length*(1+'Cable Parameters'!I76/100*('Cable Parameters'!$E$1-25))+('Insertion Loss'!$F$16+'Insertion Loss'!$F$17)*SQRT($E$3)","v":0},60,1000,-273,0.2,"http://www.eimfirst.co.il/wp-content/uploads/2018/09/sio2.pdf",2.2799999999999998,71,"SiO2-090",null,76,76,76,76,76,76,"SiO2-090",60,2.2799999999999998,0,"N/A","Indoor Only",7.62,null,"SiO2-090",1,1,1,1,1,1,1,1,1,1,1,1,1,1,1,1,1,1,1,1,1,1,1,1,1,1,1,null,1,null,false,false,false,false,false,false,null,null,{"$f":"ROW()","v":76},null,null,null,null,null,null,null,null,null,null,null,null,null,null,null,null,null,null,null,null,null,null,null,null,null,null,null,null,null,null,null,null,null,null,null,null,null,null,null,null,null,null,null,null,null,null,null,null,null,null,null,null,null,null,null,7.62,"SiO2-090","Indoor Only",null,"Indoor Only",null,null,76,0,0,76,76,null,"SiO2-090",1,1,1,1,1,0,1,0,0,0,0,0,"SiO2-090"]
["SiO2-141",0.25930700000000001,1.1999999999999999E-3,"N/A",{"$f":"((B77*SQRT($E$3*1000)+C77*$E$3*1000))/30480*Length*(1+'Cable Parameters'!I77/100*('Cable Parameters'!$E$1-25))+('Insertion Loss'!$F$16+'Insertion Loss'!$F$17)*SQRT($E$3)","v":0},50,1000,-273,0.2,"http://www.eimfirst.co.il/wp-content/uploads/2018/09/sio2.pdf",3.58,72,"SiO2-141",null,77,77,77,77,77,77,"SiO2-141",50,3.58,0,"N/A","Indoor Only",11.43,null,"SiO2-141",1,1,1,1,1,1,1,1,1,1,1,1,1,1,1,1,1,1,1,1,1,1,1,1,1,1,1,null,1,null,false,false,false,false,false,false,null,null,{"$f":"ROW()","v":77},null,null,null,null,null,null,null,null,null,null,null,null,null,null,null,null,null,null,null,null,null,null,null,null,null,null,null,null,null,null,null,null,null,null,null,null,null,null,null,null,null,null,null,null,null,null,null,null,null,null,null,null,null,null,null,11.43,"SiO2-141","Indoor Only",null,"Indoor Only",null,null,77,0,0,77,77,null,"SiO2-141",1,1,1,1,1,0,1,0,0,0,0,0,"SiO2-141"]
["SiO2-200",{"$f":"B77*0.79","v":0.20485253},1.1999999999999999E-3,"N/A",{"$f":"((B78*SQRT($E$3*1000)+C78*$E$3*1000))/30480*Length*(1+'Cable Parameters'!I78/100*('Cable Parameters'!$E$1-25))+('Insertion Loss'!$F$16+'Insertion Loss'!$F$17)*SQRT($E$3)","v":0},25,1000,-273,0.2,"http://www.eimfirst.co.il/wp-content/uploads/2018/09/sio2_single_pages.pdf",5.08,73,"SiO2-200",null,78,78,78,78,78,78,"SiO2-200",25,5.08,0,"N/A","Indoor Only",17.78,null,"SiO2-200",1,1,1,1,1,1,1,1,1,1,1,1,1,1,1,1,1,1,1,1,1,1,1,1,1,1,1,null,1,null,false,false,false,false,false,false,null,null,{"$f":"ROW()","v":78},null,null,null,null,null,null,null,null,null,null,null,null,null,null,null,null,null,null,null,null,null,null,null,null,null,null,null,null,null,null,null,null,null,null,null,null,null,null,null,null,null,null,null,null,null,null,null,null,null,null,null,null,null,null,null,17.78,"SiO2-200","Indoor Only",null,"Indoor Only",null,null,78,0,0,78,78,null,"SiO2-200",1,1,1,1,1,0,1,0,0,0,0,0,"SiO2-200"]
["SiO2-270",9.8030999999999993E-2,1.1999999999999999E-3,"N/A",{"$f":"((B79*SQRT($E$3*1000)+C79*$E$3*1000))/30480*Length*(1+'Cable Parameters'!I79/100*('Cable Parameters'!$E$1-25))+('Insertion Loss'!$F$16+'Insertion Loss'!$F$17)*SQRT($E$3)","v":0},18,1000,-273,0.2,"http://www.eimfirst.co.il/wp-content/uploads/2018/09/sio2.pdf",6.86,74,"SiO2-270",null,79,79,79,79,79,79,"SiO2-270",18,6.86,0,"N/A","Indoor Only",25.4,null,"SiO2-270",1,1,1,1,1,1,1,1,1,1,1,1,1,1,1,1,1,1,1,1,1,1,1,1,1,1,1,null,1,null,false,false,false,false,false,false,null,null,{"$f":"ROW()","v":79},null,null,null,null,null,null,null,null,null,null,0.01,0.1356,0.03,0.05,0.1,0.15,0.4,0.45,0.5,0.9,1,1.5,1.8,2,2.5,3,4,5,5.8,6,8,10,11,12,13.5,15,16,18,24,26.5,28,35,40,50,63,65,90,null,null,null,null,null,null,null,null,25.4,"SiO2-270","Indoor Only",null,"Indoor Only",null,null,79,0,0,79,79,null,"SiO2-270",1,1,1,1,1,0,1,0,0,0,0,0,"SiO2-270"]
["QEAM 400",0.1895,1.4999999999999999E-4,"N/A",{"$f":"((B80*SQRT($E$3*1000)+C80*$E$3*1000))/30480*Length*(1+'Cable Parameters'!I80/100*('Cable Parameters'!$E$1-25))+('Insertion Loss'!$F$16+'Insertion Loss'!$F$17)*SQRT($E$3)","v":0},18,90,-40,0.2,"http://www.eimfirst.co.il/wp-content/uploads/2018/08/Qeam-Tactical-Brochure.pdf",12,75,"QEAM 400",null,80,80,80,80,80,80,"QEAM 400",18,12,0,"N/A","In/Out door",127,null,"QEAM 400",1,1,1,1,1,1,1,1,1,1,1,1,1,1,1,1,1,1,1,1,1,1,1,1,1,1,1,null,1,null,false,false,false,false,false,false,null,null,{"$f":"ROW()","v":80},null,null,null,null,null,null,null,null,null,null,null,null,4000,2800,null,1600,null,900,null,700,null,null,500,null,400,null,null,null,null,200,null,200,null,null,null,null,100,100,null,null,null,null,null,null,null,null,null,null,null,null,null,null,null,null,null,127,"QEAM 400","In/Out door","In/Out door","In/Out door",null,null,80,0,0,80,80,null,"QEAM 400",0,0,0,0,0,1,0,0,0,0,0,0,"QEAM 400"]
["QEAM 500",0.11644,1.3999999999999999E-4,"N/A",{"$f":"((B81*SQRT($E$3*1000)+C81*$E$3*1000))/30480*Length*(1+'Cable Parameters'!I81/100*('Cable Parameters'!$E$1-25))+('Insertion Loss'!$F$16+'Insertion Loss'!$F$17)*SQRT($E$3)","v":0},10,90,-40,0.2,"http://www.eimfirst.co.il/wp-content/uploads/2018/08/Qeam-Tactical-Brochure.pdf",12.7,76,"QEAM 500",null,81,81,81,81,81,81,"QEAM 500",10,12.7,0,"N/A","In/Out door",127,null,"QEAM 500",1,1,1,1,1,1,1,1,1,1,1,1,1,1,1,1,1,1,1,1,1,1,1,1,1,1,1,null,1,null,false,false,false,false,false,false,null,null,{"$f":"ROW()","v":81},null,null,null,null,null,null,null,null,null,null,null,null,6000,4900,null,2800,null,1600,null,1100,null,null,800,null,700,null,null,null,null,400,null,300,null,null,null,null,null,null,null,null,null,null,null,null,null,null,null,null,null,null,null,null,null,null,null,127,"QEAM 500","In/Out door","In/Out door","In/Out door",null,null,81,0,0,81,81,null,"QEAM 500",0,0,0,0,0,1,0,0,0,0,0,0,"QEAM 500"]
["QEAM 810",6.9260000000000002E-2,1.3999999999999999E-4,"N/A",{"$f":"((B82*SQRT($E$3*1000)+C82*$E$3*1000))/30480*Length*(1+'Cable Parameters'!I82/100*('Cable Parameters'!$E$1-25))+('Insertion Loss'!$F$16+'Insertion Loss'!$F$17)*SQRT($E$3)","v":0},6,90,-40,0.2,"http://www.eimfirst.co.il/wp-content/uploads/2018/08/Qeam-Tactical-Brochure.pdf",20.57,77,"QEAM 810",null,82,82,82,82,82,82,"QEAM 810",6,20.57,0,"N/A","In/Out door",203.2,null,"QEAM 810",1,1,1,1,1,1,1,1,1,1,1,1,1,1,1,1,1,1,1,1,1,1,1,1,1,1,1,null,1,null,false,false,false,false,false,false,null,null,{"$f":"ROW()","v":82},null,null,null,null,null,null,null,null,null,null,null,null,14000,11200,null,6400,null,3600,null,2500,null,null,1700,null,1400,null,null,null,null,900,null,null,null,null,null,null,null,null,null,null,null,null,null,null,null,null,null,null,null,null,null,null,null,null,null,203.2,"QEAM 810","In/Out door","In/Out door","In/Out door",null,null,82,0,0,82,82,null,"QEAM 810",0,0,0,0,0,1,0,0,0,0,0,0,"QEAM 810"]
["SFT 142",0.31533,1.8000000000000001E-4,"N/A",{"$f":"((B83*SQRT($E$3*1000)+C83*$E$3*1000))/30480*Length*(1+'Cable Parameters'!I83/100*('Cable Parameters'!$E$1-25))+('Insertion Loss'!$F$16+'Insertion Loss'!$F$17)*SQRT($E$3)","v":0},35,200,-55,0.2,"http://www.eimfirst.co.il/wp-content/uploads/2018/09/SFT205-316.pdf",4.57,78,"SFT 142",null,83,83,83,83,83,83,"SFT 142",35,4.57,0,"N/A","In/Out door",19.05,null,"SFT 142",1,1,1,1,1,1,1,1,1,1,1,1,1,1,1,1,1,1,1,1,1,1,1,1,1,1,1,null,1,null,false,false,false,false,false,false,null,null,{"$f":"ROW()","v":83},null,null,null,null,null,null,null,null,null,null,null,5040,3382,null,1843,1501,912,null,null,601,569,461,null,397,null,320,275,244,null,221,189,167,null,151,141,133,null,120,101,null,92,81,null,null,null,null,null,null,null,null,null,null,null,null,null,19.05,"SFT 142","In/Out door","In/Out door","In/Out door",null,null,83,0,0,83,83,null,"SFT 142",1,0,1,0,1,1,1,0,0,1,0,0,"SFT 142"]
["SFT 205",0.26097999999999999,1.8000000000000001E-4,"N/A",{"$f":"((B84*SQRT($E$3*1000)+C84*$E$3*1000))/30480*Length*(1+'Cable Parameters'!I84/100*('Cable Parameters'!$E$1-25))+('Insertion Loss'!$F$16+'Insertion Loss'!$F$17)*SQRT($E$3)","v":0},28,200,-55,0.2,"http://www.eimfirst.co.il/wp-content/uploads/2018/09/SFT205-316.pdf",5.2,79,"SFT 205",null,84,84,84,84,84,84,"SFT 205",28,5.2,0,"N/A","In/Out door",25.4,null,"SFT 205",1,1,1,1,1,1,1,1,1,1,1,1,1,1,1,1,1,1,1,1,1,1,1,1,1,1,1,null,1,null,false,false,false,false,false,false,null,null,{"$f":"ROW()","v":84},null,null,null,null,null,null,null,null,null,null,null,6648,4461,null,2431,1980,1202,null,null,792,750,608,null,523,null,422,362,321,null,291,249,220,null,198,null,186,null,157,133,null,122,null,null,null,null,null,null,null,null,null,null,null,null,null,null,25.4,"SFT 205","In/Out door","In/Out door","In/Out door",null,null,84,0,0,84,84,null,"SFT 205",1,0,1,0,1,1,1,0,0,1,0,0,"SFT 205"]
["SFT 226",0.12182999999999999,1.8000000000000001E-4,"N/A",{"$f":"((B85*SQRT($E$3*1000)+C85*$E$3*1000))/30480*Length*(1+'Cable Parameters'!I85/100*('Cable Parameters'!$E$1-25))+('Insertion Loss'!$F$16+'Insertion Loss'!$F$17)*SQRT($E$3)","v":0},10,200,-55,0.2,"http://www.eimfirst.co.il/wp-content/uploads/2018/09/SFT393-600.pdf",12.3,80,"SFT 226",null,85,85,85,85,85,85,"SFT 226",10,12.3,0,"N/A","In/Out door",63.5,null,"SFT 226",1,1,1,1,1,1,1,1,1,1,1,1,1,1,1,1,1,1,1,1,1,1,1,1,1,1,1,null,1,null,false,false,false,false,false,false,null,null,{"$f":"ROW()","v":85},null,null,null,null,null,null,null,null,null,null,null,37095,null,19241,16558,null,null,null,null,null,4182,3388,null,2915,2592,2354,null,null,null,null,null,null,null,null,null,null,null,null,null,null,null,null,null,null,null,null,null,null,null,null,null,null,null,null,null,63.5,"SFT 226","In/Out door","In/Out door","In/Out door",null,null,85,0,0,85,85,null,"SFT 226",1,0,1,0,1,1,1,0,0,1,0,0,"SFT 226"]
["SFT 304",0.20810000000000001,1.8000000000000001E-4,"N/A",{"$f":"((B86*SQRT($E$3*1000)+C86*$E$3*1000))/30480*Length*(1+'Cable Parameters'!I86/100*('Cable Parameters'!$E$1-25))+('Insertion Loss'!$F$16+'Insertion Loss'!$F$17)*SQRT($E$3)","v":0},24,200,-55,0.2,"http://www.eimfirst.co.il/wp-content/uploads/2018/09/SFT304-320.pdf",6.35,81,"SFT 304",null,86,86,86,86,86,86,"SFT 304",24,6.35,0,"N/A","In/Out door",31.75,null,"SFT 304",1,1,1,1,1,1,1,1,1,1,1,1,1,1,1,1,1,1,1,1,1,1,1,1,1,1,1,null,1,null,false,false,false,false,false,false,null,null,{"$f":"ROW()","v":86},null,null,null,null,null,null,null,null,null,null,null,9057,6076,null,3310,2695,1635,null,null,1077,1020,826,null,710,null,573,491,435,null,394,336,297,null,268,251,236,null,213,180,null,null,null,null,null,null,null,null,null,null,null,null,null,null,null,null,31.75,"SFT 304","In/Out door","In/Out door","In/Out door",null,null,86,0,0,86,86,null,"SFT 304",1,0,1,0,1,1,1,0,0,1,0,0,"SFT 304"]
["SFT 304 PUR",0.21049999999999999,1.46E-4,"N/A",{"$f":"((B87*SQRT($E$3*1000)+C87*$E$3*1000))/30480*Length*(1+'Cable Parameters'!I87/100*('Cable Parameters'!$E$1-25))+('Insertion Loss'!$F$16+'Insertion Loss'!$F$17)*SQRT($E$3)","v":0},18,200,-55,0.2,"http://www.eimfirst.co.il/wp-content/uploads/2018/09/sorry.jpg",6.5,82,"SFT 304 PUR",null,87,87,87,87,87,87,"SFT 304 PUR",18,6.5,0,"N/A","In/Out door",31.75,null,"SFT 304 PUR",1,1,1,1,1,1,1,1,1,1,1,1,1,1,1,1,1,1,1,1,1,1,1,1,1,1,1,null,1,null,false,false,false,false,false,false,null,null,{"$f":"ROW()","v":87},null,null,null,null,null,null,null,null,null,null,null,null,null,null,null,null,null,null,null,null,null,null,null,null,null,null,null,null,null,null,null,null,null,null,null,null,null,null,null,null,null,null,null,null,null,null,null,null,null,null,null,null,null,null,null,31.75,"SFT 304 PUR","In/Out door","In/Out door","In/Out door",null,null,87,0,0,87,87,null,"SFT 304 PUR",1,0,1,0,1,1,1,0,0,1,0,0,"SFT 304 PUR"]
["SFT 316",0.55167999999999995,1.8000000000000001E-4,"N/A",{"$f":"((B88*SQRT($E$3*1000)+C88*$E$3*1000))/30480*Length*(1+'Cable Parameters'!I88/100*('Cable Parameters'!$E$1-25))+('Insertion Loss'!$F$16+'Insertion Loss'!$F$17)*SQRT($E$3)","v":0},63,200,-55,0.2,"http://www.eimfirst.co.il/wp-content/uploads/2018/09/SFT205-316.pdf",3.05,83,"SFT 316",null,88,88,88,88,88,88,"SFT 316",63,3.05,0,"N/A","In/Out door",12.7,null,"SFT 316",1,1,1,1,1,1,1,1,1,1,1,1,1,1,1,1,1,1,1,1,1,1,1,1,1,1,1,null,1,null,false,false,false,false,false,false,null,null,{"$f":"ROW()","v":88},null,null,null,null,null,null,null,null,null,null,null,4044,2713,null,1478,1203,730,null,null,481,455,368,null,316,null,255,219,194,null,175,149,132,null,119,111,105,null,94,79,null,72,63,null,null,43,null,null,null,null,null,null,null,null,null,null,12.7,"SFT 316","In/Out door","In/Out door","In/Out door",null,null,88,0,0,88,88,null,"SFT 316",1,0,1,0,1,1,1,0,0,1,0,0,"SFT 316"]
["SFT 318",0.192356,1.46E-4,"N/A",{"$f":"((B89*SQRT($E$3*1000)+C89*$E$3*1000))/30480*Length*(1+'Cable Parameters'!I89/100*('Cable Parameters'!$E$1-25))+('Insertion Loss'!$F$16+'Insertion Loss'!$F$17)*SQRT($E$3)","v":0},18,200,-55,0.2,"http://www.eimfirst.co.il/wp-content/uploads/2018/09/SFT304-320.pdf",7.39,84,"SFT 318",null,89,89,89,89,89,89,"SFT 318",18,7.39,0,"N/A","In/Out door",44.45,null,"SFT 318",1,1,1,1,1,1,1,1,1,1,1,1,1,1,1,1,1,1,1,1,1,1,1,1,1,1,1,null,1,null,false,false,false,false,false,false,null,null,{"$f":"ROW()","v":89},null,null,null,null,null,null,null,null,null,null,null,10800,7240,null,3950,3220,1950,null,null,1290,1220,990,null,850,null,690,590,520,null,470,410,360,null,320,300,290,null,260,null,null,null,null,null,null,null,null,null,null,null,null,null,null,null,null,null,44.45,"SFT 318","In/Out door","In/Out door","In/Out door",null,null,89,0,0,89,89,null,"SFT 318",1,0,1,0,1,1,1,0,0,1,0,0,"SFT 318"]
["SFT 320",0.15406500000000001,1.83E-4,"N/A",{"$f":"((B90*SQRT($E$3*1000)+C90*$E$3*1000))/30480*Length*(1+'Cable Parameters'!I90/100*('Cable Parameters'!$E$1-25))+('Insertion Loss'!$F$16+'Insertion Loss'!$F$17)*SQRT($E$3)","v":0},12,200,-55,0.2,"http://www.eimfirst.co.il/wp-content/uploads/2018/09/SFT304-320.pdf",8.18,85,"SFT 320",null,90,90,90,90,90,90,"SFT 320",12,8.18,0,"N/A","In/Out door",47.24,null,"SFT 320",1,1,1,1,1,1,1,1,1,1,1,1,1,1,1,1,1,1,1,1,1,1,1,1,1,1,1,null,1,null,false,false,false,false,false,false,null,null,{"$f":"ROW()","v":90},null,null,null,null,null,null,null,null,null,null,null,13800,9200,null,5000,4100,2500,null,null,1600,1500,1200,null,1100,null,860,730,650,null,590,500,440,null,400,null,null,null,null,null,null,null,null,null,null,null,null,null,null,null,null,null,null,null,null,null,47.24,"SFT 320","In/Out door","In/Out door","In/Out door",null,null,90,0,0,90,90,null,"SFT 320",1,0,1,0,1,1,1,0,0,1,0,0,"SFT 320"]
["SFT 393",0.13593,1.8000000000000001E-4,"N/A",{"$f":"((B91*SQRT($E$3*1000)+C91*$E$3*1000))/30480*Length*(1+'Cable Parameters'!I91/100*('Cable Parameters'!$E$1-25))+('Insertion Loss'!$F$16+'Insertion Loss'!$F$17)*SQRT($E$3)","v":0},15,200,-55,0.2,"http://www.eimfirst.co.il/wp-content/uploads/2018/09/SFT393-600.pdf",9.91,86,"SFT 393",null,91,91,91,91,91,91,"SFT 393",15,9.91,0,"N/A","In/Out door",50.8,null,"SFT 393",1,1,1,1,1,1,1,1,1,1,1,1,1,1,1,1,1,1,1,1,1,1,1,1,1,1,1,null,1,null,false,false,false,false,false,false,null,null,{"$f":"ROW()","v":91},null,null,null,null,null,null,null,null,null,null,null,27605,null,14319,10090,null,null,null,null,null,3113,2522,null,2169,1929,1752,null,null,null,null,null,null,null,null,null,null,null,null,null,null,null,null,null,null,null,null,null,null,null,null,null,null,null,null,null,50.8,"SFT 393","In/Out door","In/Out door","In/Out door",null,null,91,0,0,91,91,null,"SFT 393",1,0,1,0,1,1,1,0,0,1,0,0,"SFT 393"]
["SFT 500",0.117433,1.83E-4,"N/A",{"$f":"((B92*SQRT($E$3*1000)+C92*$E$3*1000))/30480*Length*(1+'Cable Parameters'!I92/100*('Cable Parameters'!$E$1-25))+('Insertion Loss'!$F$16+'Insertion Loss'!$F$17)*SQRT($E$3)","v":0},3,200,-55,0.2,"http://www.eimfirst.co.il/wp-content/uploads/2018/09/sft-500.pdf",12.45,87,"SFT 500",null,92,92,92,92,92,92,"SFT 500",3,12.45,0,"N/A","In/Out door",63.5,null,"SFT 500",1,1,1,1,1,1,1,1,1,1,1,1,1,1,1,1,1,1,1,1,1,1,1,1,1,1,1,null,1,null,false,false,false,false,false,false,null,null,{"$f":"ROW()","v":92},null,null,null,null,null,null,null,null,null,null,null,42102,null,21820,15366,null,null,null,null,null,4717,3815,null,3278,2912,2642,null,null,null,null,null,null,null,null,null,null,null,null,null,null,null,null,null,null,null,null,null,null,null,null,null,null,null,null,null,63.5,"SFT 500","In/Out door","In/Out door","In/Out door",null,null,92,0,0,92,92,null,"SFT 500",1,0,1,0,1,1,1,0,0,1,0,0,"SFT 500"]
["SFT 600",0.101373,1.8000000000000001E-4,"N/A",{"$f":"((B93*SQRT($E$3*1000)+C93*$E$3*1000))/30480*Length*(1+'Cable Parameters'!I93/100*('Cable Parameters'!$E$1-25))+('Insertion Loss'!$F$16+'Insertion Loss'!$F$17)*SQRT($E$3)","v":0},8,200,-55,0.2,"http://www.eimfirst.co.il/wp-content/uploads/2018/09/SFT393-600.pdf",14.35,88,"SFT 600",null,93,93,93,93,93,93,"SFT 600",8,14.35,0,"N/A","In/Out door",69.900000000000006,null,"SFT 600",1,1,1,1,1,1,1,1,1,1,1,1,1,1,1,1,1,1,1,1,1,1,1,1,1,1,1,null,1,null,false,false,false,false,false,false,null,null,{"$f":"ROW()","v":93},null,null,null,null,null,null,null,null,null,null,null,51888,null,26900,18948,null,null,null,null,null,5826,4715,null,4053,3601,3268,null,null,null,null,null,null,null,null,null,null,null,null,null,null,null,null,null,null,null,null,null,null,null,null,null,null,null,null,null,69.900000000000006,"SFT 600","In/Out door","In/Out door","In/Out door",null,null,93,0,0,93,93,null,"SFT 600",1,0,1,0,1,1,1,0,0,1,0,0,"SFT 600"]
["SFT-600-BCCAL",8.6947999999999998E-2,1.83E-4,"N/A",{"$f":"((B94*SQRT($E$3*1000)+C94*$E$3*1000))/30480*Length*(1+'Cable Parameters'!I94/100*('Cable Parameters'!$E$1-25))+('Insertion Loss'!$F$16+'Insertion Loss'!$F$17)*SQRT($E$3)","v":0},3,200,-55,0.2,"http://www.eimfirst.co.il/wp-content/uploads/2018/09/Some-Other-Cables-2.pdf",14.22,89,"SFT-600-BCCAL",null,94,94,94,94,94,94,"SFT-600-BCCAL",3,14.22,0,"N/A","In/Out door",63.5,null,"SFT-600-BCCAL",1,1,1,1,1,1,1,1,1,1,1,1,1,1,1,1,1,1,1,1,1,1,1,1,1,1,1,null,1,null,false,false,false,false,false,false,null,null,{"$f":"ROW()","v":94},null,null,null,null,null,null,null,null,null,null,null,61389,null,31756,22326,null,null,null,null,null,6775,5460,null,4677,4144,3751,null,null,null,null,null,null,null,null,null,null,null,null,null,null,null,null,null,null,null,null,null,null,null,null,null,null,null,null,null,63.5,"SFT-600-BCCAL","In/Out door","In/Out door","In/Out door",null,null,94,0,0,94,94,null,"SFT-600-BCCAL",1,0,1,0,1,1,1,0,0,1,0,0,"SFT-600-BCCAL"]
["SFT-600-BCCAL-PUR",8.6947999999999998E-2,1.83E-4,"N/A",{"$f":"((B95*SQRT($E$3*1000)+C95*$E$3*1000))/30480*Length*(1+'Cable Parameters'!I95/100*('Cable Parameters'!$E$1-25))+('Insertion Loss'!$F$16+'Insertion Loss'!$F$17)*SQRT($E$3)","v":0},3,90,-55,0.2,"http://www.eimfirst.co.il/wp-content/uploads/2018/09/Some-Other-Cables-1.pdf",14.22,90,"SFT-600-BCCAL-PUR",null,95,95,95,95,95,95,"SFT-600-BCCAL-PUR",3,14.22,0,"N/A","In/Out door",63.5,null,"SFT-600-BCCAL-PUR",1,1,1,1,1,1,1,1,1,1,1,1,1,1,1,1,1,1,1,1,1,1,1,1,1,1,1,null,1,null,false,false,false,false,false,false,null,null,{"$f":"ROW()","v":95},null,null,null,null,null,null,null,null,null,null,null,24515,null,12681,8916,null,null,null,null,null,2706,2180,null,1868,1655,1498,null,null,null,null,null,null,null,null,null,null,null,null,null,null,null,null,null,null,null,null,null,null,null,null,null,null,null,null,null,63.5,"SFT-600-BCCAL-PUR","In/Out door","In/Out door","In/Out door",null,null,95,0,0,95,95,null,"SFT-600-BCCAL-PUR",1,0,1,0,1,1,1,0,0,1,0,0,"SFT-600-BCCAL-PUR"]
["TCOM 400-UF",0.12229,2.5999999999999998E-4,"N/A",{"$f":"((B96*SQRT($E$3*1000)+C96*$E$3*1000))/30480*Length*(1+'Cable Parameters'!I96/100*('Cable Parameters'!$E$1-25))+('Insertion Loss'!$F$16+'Insertion Loss'!$F$17)*SQRT($E$3)","v":0},16,90,-40,0.2,"http://www.eimfirst.co.il/wp-content/uploads/2018/09/TCOM-400-600.pdf",10.199999999999999,91,"TCOM 400-UF",null,96,96,96,96,96,96,"TCOM 400-UF",16,10.199999999999999,0,"N/A","In/Out door",101.6,null,"TCOM 400-UF",1,1,1,1,1,1,1,1,1,1,1,1,1,1,1,1,1,1,1,1,1,1,1,1,1,1,1,null,1,null,false,false,false,false,false,false,null,null,{"$f":"ROW()","v":96},null,null,null,null,null,null,null,null,null,null,null,null,3000,2600,null,1500,null,800,null,580,null,null,400,null,330,null,null,null,null,200,null,150,null,null,null,null,110,null,null,null,null,null,null,null,null,null,null,null,null,null,null,null,null,null,null,101.6,"TCOM 400-UF","In/Out door","In/Out door","In/Out door",null,null,96,0,0,96,96,null,"TCOM 400-UF",0,0,0,0,0,1,0,0,0,0,1,0,"TCOM 400-UF"]
["TCOM 400-FS",0.14369000000000001,3.1E-4,"N/A",{"$f":"((B97*SQRT($E$3*1000)+C97*$E$3*1000))/30480*Length*(1+'Cable Parameters'!I97/100*('Cable Parameters'!$E$1-25))+('Insertion Loss'!$F$16+'Insertion Loss'!$F$17)*SQRT($E$3)","v":0},16,90,-40,0.2,"http://www.eimfirst.co.il/wp-content/uploads/2018/09/TCOM-400-600.pdf",10,92,"TCOM 400-FS",null,97,97,97,97,97,97,"TCOM 400-FS",16,10,0,"N/A","In/Out door",101.6,null,"TCOM 400-FS",1,1,1,1,1,1,1,1,1,1,1,1,1,1,1,1,1,1,1,1,1,1,1,1,1,1,1,null,1,null,false,false,false,false,false,false,null,null,{"$f":"ROW()","v":97},null,null,null,null,null,null,null,null,null,null,null,null,2900,2200,null,1300,null,730,null,500,null,null,350,null,290,null,null,null,null,310,null,130,null,null,null,null,100,null,null,null,null,null,null,null,null,null,null,null,null,null,null,null,null,null,null,101.6,"TCOM 400-FS","In/Out door","In/Out door","In/Out door",null,null,97,0,0,97,97,null,"TCOM 400-FS",0,0,0,0,0,1,0,0,0,0,1,0,"TCOM 400-FS"]
["TCOM 600-UF",7.5550000000000006E-2,2.5999999999999998E-4,"N/A",{"$f":"((B98*SQRT($E$3*1000)+C98*$E$3*1000))/30480*Length*(1+'Cable Parameters'!I98/100*('Cable Parameters'!$E$1-25))+('Insertion Loss'!$F$16+'Insertion Loss'!$F$17)*SQRT($E$3)","v":0},10,90,-40,0.2,"http://www.eimfirst.co.il/wp-content/uploads/2018/09/TCOM-400-600.pdf",15,93,"TCOM 600-UF",null,98,98,98,98,98,98,"TCOM 600-UF",10,15,0,"N/A","In/Out door",152.4,null,"TCOM 600-UF",1,1,1,1,1,1,1,1,1,1,1,1,1,1,1,1,1,1,1,1,1,1,1,1,1,1,1,null,1,null,false,false,false,false,false,false,null,null,{"$f":"ROW()","v":98},null,null,null,null,null,null,null,null,null,null,null,null,5500,4200,null,2400,null,1300,null,930,null,null,630,null,520,null,null,null,null,310,null,230,null,null,null,null,null,null,null,null,null,null,null,null,null,null,null,null,null,null,null,null,null,null,null,152.4,"TCOM 600-UF","In/Out door","In/Out door","In/Out door",null,null,98,0,0,98,98,null,"TCOM 600-UF",0,0,0,0,0,1,0,0,0,0,1,0,"TCOM 600-UF"]
["TCOM 600-FS",8.8800000000000004E-2,3.1E-4,"N/A",{"$f":"((B99*SQRT($E$3*1000)+C99*$E$3*1000))/30480*Length*(1+'Cable Parameters'!I99/100*('Cable Parameters'!$E$1-25))+('Insertion Loss'!$F$16+'Insertion Loss'!$F$17)*SQRT($E$3)","v":0},10,90,-40,0.2,"http://www.eimfirst.co.il/wp-content/uploads/2018/09/TCOM-400-600.pdf",15,94,"TCOM 600-FS",null,99,99,99,99,99,99,"TCOM 600-FS",10,15,0,"N/A","In/Out door",152.4,null,"TCOM 600-FS",1,1,1,1,1,1,1,1,1,1,1,1,1,1,1,1,1,1,1,1,1,1,1,1,1,1,1,null,1,null,false,false,false,false,false,false,null,null,{"$f":"ROW()","v":99},null,null,null,null,null,null,null,null,null,null,null,null,5000,3600,null,2000,null,1100,null,800,null,null,530,null,440,null,null,null,null,260,null,190,null,null,null,null,null,null,null,null,null,null,null,null,null,null,null,null,null,null,null,null,null,null,null,152.4,"TCOM 600-FS","In/Out door","In/Out door","In/Out door",null,null,99,0,0,99,99,null,"TCOM 600-FS",0,0,0,0,0,1,0,0,0,0,1,0,"TCOM 600-FS"]
["TFlex 401",0.21,1.1999999999999999E-3,"N/A",{"$f":"((B100*SQRT($E$3*1000)+C100*$E$3*1000))/30480*Length*(1+'Cable Parameters'!I100/100*('Cable Parameters'!$E$1-25))+('Insertion Loss'!$F$16+'Insertion Loss'!$F$17)*SQRT($E$3)","v":0},19,125,-65,0.2,"http://www.eimfirst.co.il/wp-content/uploads/2018/07/TFlex.pdf",6.9,95,"TFlex 401",null,100,100,100,100,100,100,"TFlex 401",19,6.9,0,"N/A","Indoor Only",28.574999999999999,null,"TFlex 401",1,1,1,1,1,1,1,1,1,1,1,1,1,1,1,1,1,1,1,1,1,1,1,1,1,1,1,null,1,null,false,false,false,false,false,false,null,null,{"$f":"ROW()","v":100},null,null,null,null,null,null,null,null,null,null,null,null,null,3010,2095,null,null,null,885,null,595,null,null,394,null,null,257,null,null,198,null,136,null,120,null,null,102,88,null,null,null,null,null,null,null,null,null,null,null,null,null,null,null,null,null,28.574999999999999,"TFlex 401","Indoor Only",null,"Indoor Only",null,null,100,0,0,100,100,null,"TFlex 401",0,0,0,0,1,0,0,0,0,0,0,0,"TFlex 401"]
["TFlex 402",0.33,1.1999999999999999E-3,"N/A",{"$f":"((B101*SQRT($E$3*1000)+C101*$E$3*1000))/30480*Length*(1+'Cable Parameters'!I101/100*('Cable Parameters'!$E$1-25))+('Insertion Loss'!$F$16+'Insertion Loss'!$F$17)*SQRT($E$3)","v":0},34,125,-65,0.2,"http://www.eimfirst.co.il/wp-content/uploads/2018/07/TFlex.pdf",4.0599999999999996,96,"TFlex 402",null,101,101,101,101,101,101,"TFlex 402",34,4.0599999999999996,0,"N/A","Indoor Only",12.7,null,"TFlex 402",1,1,1,1,1,1,1,1,1,1,1,1,1,1,1,1,1,1,1,1,1,1,1,1,1,1,1,null,1,null,false,false,false,false,false,false,null,null,{"$f":"ROW()","v":101},null,null,null,null,null,null,null,null,null,null,null,null,null,1386,980,null,null,null,418,null,290,null,null,198,null,null,132,null,null,105,null,78,null,69,null,null,58,54,null,41,null,null,null,null,null,null,null,null,null,null,null,null,null,null,null,12.7,"TFlex 402","Indoor Only",null,"Indoor Only",null,null,101,0,0,101,101,null,"TFlex 402",0,0,0,0,1,0,0,0,0,0,0,0,"TFlex 402"]
["TFlex 405",0.63,1.1999999999999999E-3,"N/A",{"$f":"((B102*SQRT($E$3*1000)+C102*$E$3*1000))/30480*Length*(1+'Cable Parameters'!I102/100*('Cable Parameters'!$E$1-25))+('Insertion Loss'!$F$16+'Insertion Loss'!$F$17)*SQRT($E$3)","v":0},60,125,-65,0.2,"http://www.eimfirst.co.il/wp-content/uploads/2018/07/TFlex.pdf",2.64,97,"TFlex 405",null,102,102,102,{"$f":"IF(Q102=\"\",\"\",IF($R$2=\"\",Q102,IF(OR(INDEX(A:WQ,ROW(),4)=$R$2,INDEX(A:WQ,ROW(),4)>$R$2),ROW(),\"\")))","v":102},102,102,"TFlex 405",60,2.64,0,"N/A",{"$f":"IF(ISERROR(IF($Q$2=\"\",INDEX(A:WQ,T102,128),IF($Q$2=1,INDEX(A:WQ,T102,126),INDEX(A:WQ,T102,127)))),\"\",IF($Q$2=\"\",INDEX(A:WQ,T102,128),IF($Q$2=1,INDEX(A:WQ,T102,126),INDEX(A:WQ,T102,127))))","v":"Indoor Only"},{"$f":"IF(T102=\"\",\"\",INDEX(A:WQ,T102,124))","v":6.35},null,"TFlex 405",1,1,1,1,1,1,1,1,1,1,1,1,1,1,1,1,1,1,1,1,1,1,1,1,1,1,1,null,1,null,false,false,false,false,false,false,null,null,{"$f":"ROW()","v":102},null,null,null,null,null,null,null,null,null,null,null,null,null,560,390,null,null,null,173,null,121,null,null,85,null,null,59,null,null,47,null,36,null,33,null,null,28,26,null,21,null,null,17,null,null,null,null,null,null,null,null,null,null,null,null,6.35,"TFlex 405","Indoor Only",null,"Indoor Only",null,null,102,0,0,102,102,null,"TFlex 405",0,0,0,0,1,0,0,0,0,0,0,0,"TFlex 405"]
["FBT 195",0.34082000000000001,1.83E-4,"N/A",{"$f":"((B103*SQRT($E$3*1000)+C103*$E$3*1000))/30480*Length*(1+'Cable Parameters'!I103/100*('Cable Parameters'!$E$1-25))+('Insertion Loss'!$F$16+'Insertion Loss'!$F$17)*SQRT($E$3)","v":0},5.8,150,-55,0.2,"http://www.eimfirst.co.il/wp-content/uploads/2018/09/FBT-195-600.pdf",4.4000000000000004,98,"FBT 195",null,103,{"$f":"IF(O103=\"\",\"\",IF($P$2=\"\",O103,IF(OR(INDEX(A:M,ROW(),6)=$P$2,INDEX(A:M,ROW(),6)>$P$2),ROW(),\"\")))","v":103},{"$f":"IF(P103=\"\",\"\",IF($Q$2=\"\",P103,IF(INDEX(DV:DW,ROW(),$Q$2)=\"\",\"\",ROW())))","v":103},103,{"$f":"IF(R103=\"\",\"\",IF($S$2=\"\",R103,IF(OR(INDEX(A:N,ROW(),11)>$S$2+1,INDEX(A:N,ROW(),11)<$S$2-1),\"\",ROW())))","v":103},103,{"$f":"IF(T103=\"\",\"\",INDEX(A:M,T103,1))","v":"FBT 195"},{"$f":"IF(T103=\"\",\"\",INDEX(A:N,T103,6))","v":5.8},{"$f":"IF(T103=\"\",\"\",INDEX(A:O,T103,11))","v":4.4000000000000004},{"$f":"IF(T103=\"\",\"\",INDEX(A:P,T103,5))","v":0},{"$f":"IF(T103=\"\",\"\",INDEX(A:R,T103,4))","v":"N/A"},"In/Out door",22.22,null,"FBT 195",1,1,1,1,1,1,1,1,1,1,1,1,1,1,1,1,1,1,1,1,1,1,1,1,1,1,1,null,1,null,false,false,false,false,false,false,null,null,{"$f":"ROW()","v":103},null,null,null,null,null,null,null,null,null,null,null,null,1600,1250,null,720,null,410,null,290,270,220,null,190,170,null,null,null,110,null,null,null,null,null,null,null,null,null,null,null,null,null,null,null,null,null,null,null,null,null,null,null,null,null,null,22.22,"FBT 195","In/Out door","In/Out door","In/Out door",null,null,103,0,0,103,103,null,"FBT 195",1,0,0,0,0,0,0,0,0,1,1,1,"FBT 195"]
["FBT 200",0.32907500000000001,1.83E-4,"N/A",{"$f":"((B104*SQRT($E$3*1000)+C104*$E$3*1000))/30480*Length*(1+'Cable Parameters'!I104/100*('Cable Parameters'!$E$1-25))+('Insertion Loss'!$F$16+'Insertion Loss'!$F$17)*SQRT($E$3)","v":0},5.8,150,-55,0.2,"http://www.eimfirst.co.il/wp-content/uploads/2018/09/FBT-195-600.pdf",4.4000000000000004,99,"FBT 200",null,104,104,104,104,104,104,"FBT 200",5.8,4.4000000000000004,0,"N/A","In/Out door",22.22,null,"FBT 200",1,1,1,1,1,1,1,1,1,1,1,1,1,1,1,1,1,1,1,1,1,1,1,1,1,1,1,null,1,null,false,false,false,false,false,false,null,null,{"$f":"ROW()","v":104},null,null,null,null,null,null,null,null,null,null,null,null,1700,1300,null,760,null,430,null,300,290,230,null,200,180,null,null,null,110,null,null,null,null,null,null,null,null,null,null,null,null,null,null,null,null,null,null,null,null,null,null,null,null,null,null,22.22,"FBT 200","In/Out door","In/Out door","In/Out door",null,null,104,0,0,104,104,null,"FBT 200",1,0,0,0,0,0,0,0,0,1,1,1,"FBT 200"]
["FBT 240",0.24851500000000001,1.83E-4,"N/A",{"$f":"((B105*SQRT($E$3*1000)+C105*$E$3*1000))/30480*Length*(1+'Cable Parameters'!I105/100*('Cable Parameters'!$E$1-25))+('Insertion Loss'!$F$16+'Insertion Loss'!$F$17)*SQRT($E$3)","v":0},5.8,150,-55,0.2,"http://www.eimfirst.co.il/wp-content/uploads/2018/09/FBT-195-600.pdf",5.2,100,"FBT 240",null,105,105,105,105,105,105,"FBT 240",5.8,5.2,0,"N/A","In/Out door",25.4,null,"FBT 240",1,1,1,1,1,1,1,1,1,1,1,1,1,1,1,1,1,1,1,1,1,1,1,1,1,1,1,null,1,null,false,false,false,false,false,false,null,null,{"$f":"ROW()","v":105},null,null,null,null,null,null,null,null,null,null,null,null,2500,1900,null,1100,null,630,null,440,420,340,null,290,260,null,null,null,160,null,null,null,null,null,null,null,null,null,null,null,null,null,null,null,null,null,null,null,null,null,null,null,null,null,null,25.4,"FBT 240","In/Out door","In/Out door","In/Out door",null,null,105,0,0,105,105,null,"FBT 240",1,0,0,0,0,0,0,0,0,1,1,1,"FBT 240"]
["FBT 300",0.200179,1.83E-4,"N/A",{"$f":"((B106*SQRT($E$3*1000)+C106*$E$3*1000))/30480*Length*(1+'Cable Parameters'!I106/100*('Cable Parameters'!$E$1-25))+('Insertion Loss'!$F$16+'Insertion Loss'!$F$17)*SQRT($E$3)","v":0},5.8,150,-55,0.2,"http://www.eimfirst.co.il/wp-content/uploads/2018/09/FBT-195-600.pdf",6.6,101,"FBT 300",null,106,106,106,106,106,106,"FBT 300",5.8,6.6,0,"N/A","In/Out door",31.75,null,"FBT 300",1,1,1,1,1,1,1,1,1,1,1,1,1,1,1,1,1,1,1,1,1,1,1,1,1,1,1,null,1,null,false,false,false,false,false,false,null,null,{"$f":"ROW()","v":106},null,null,null,null,null,null,null,null,null,null,null,null,3400,2600,null,1500,null,850,null,600,570,460,null,390,350,null,null,null,220,null,null,null,null,null,null,null,null,null,null,null,null,null,null,null,null,null,null,null,null,null,null,null,null,null,null,31.75,"FBT 300","In/Out door","In/Out door","In/Out door",null,null,106,0,0,106,106,null,"FBT 300",1,0,0,0,0,0,0,0,0,1,1,1,"FBT 300"]
["FBT 400",0.129138,1.46E-4,"N/A",{"$f":"((B107*SQRT($E$3*1000)+C107*$E$3*1000))/30480*Length*(1+'Cable Parameters'!I107/100*('Cable Parameters'!$E$1-25))+('Insertion Loss'!$F$16+'Insertion Loss'!$F$17)*SQRT($E$3)","v":0},5.8,150,-55,0.2,"http://www.eimfirst.co.il/wp-content/uploads/2018/09/fbt400-600.pdf",9.4,102,"FBT 400",null,107,107,107,107,107,107,"FBT 400",5.8,9.4,0,"N/A","In/Out door",44.45,null,"FBT 400",1,1,1,1,1,1,1,1,1,1,1,1,1,1,1,1,1,1,1,1,1,1,1,1,1,1,1,null,1,null,false,false,false,false,false,false,null,null,{"$f":"ROW()","v":107},null,null,null,null,null,null,null,null,null,null,null,null,6200,4800,null,2800,null,1600,null,1100,1000,840,null,730,650,null,null,null,410,null,null,null,null,null,null,null,null,null,null,null,null,null,null,null,null,null,null,null,null,null,null,null,null,null,null,44.45,"FBT 400","In/Out door","In/Out door","In/Out door",null,null,107,0,0,107,107,null,"FBT 400",1,0,0,0,0,0,0,0,0,1,1,1,"FBT 400"]
["FBT 500",0.100255,1.46E-4,"N/A",{"$f":"((B108*SQRT($E$3*1000)+C108*$E$3*1000))/30480*Length*(1+'Cable Parameters'!I108/100*('Cable Parameters'!$E$1-25))+('Insertion Loss'!$F$16+'Insertion Loss'!$F$17)*SQRT($E$3)","v":0},5.8,150,-55,0.2,"http://www.eimfirst.co.il/wp-content/uploads/2018/09/fbt400-600.pdf",11.8,103,"FBT 500",null,108,108,108,108,108,108,"FBT 500",5.8,11.8,0,"N/A","In/Out door",57.15,null,"FBT 500",1,1,1,1,1,1,1,1,1,1,1,1,1,1,1,1,1,1,1,1,1,1,1,1,1,1,1,null,1,null,false,false,false,false,false,false,null,null,{"$f":"ROW()","v":108},null,null,null,null,null,null,null,null,null,null,null,null,8900,6900,null,3900,null,2200,null,1600,1500,1200,null,1000,900,null,null,null,600,null,null,null,null,null,null,null,null,null,null,null,null,null,null,null,null,null,null,null,null,null,null,null,null,null,null,57.15,"FBT 500","In/Out door","In/Out door","In/Out door",null,null,108,0,0,108,108,null,"FBT 500",1,0,0,0,0,0,0,0,0,1,1,1,"FBT 500"]
["FBT 600",8.1389000000000003E-2,1.46E-4,"N/A",{"$f":"((B109*SQRT($E$3*1000)+C109*$E$3*1000))/30480*Length*(1+'Cable Parameters'!I109/100*('Cable Parameters'!$E$1-25))+('Insertion Loss'!$F$16+'Insertion Loss'!$F$17)*SQRT($E$3)","v":0},5.8,150,-55,0.2,"http://www.eimfirst.co.il/wp-content/uploads/2018/09/fbt400-600.pdf",14.35,104,"FBT 600",null,109,109,109,109,109,109,"FBT 600",5.8,14.35,0,"N/A","In/Out door",69.849999999999994,null,"FBT 600",1,1,1,1,1,1,1,1,1,1,1,1,1,1,1,1,1,1,1,1,1,1,1,1,1,1,1,null,1,null,false,false,false,false,false,false,null,null,{"$f":"ROW()","v":109},null,null,null,null,null,null,null,null,null,null,null,null,11800,9100,null,5200,null,3000,null,2100,1900,1600,null,1300,1200,null,null,null,700,null,null,null,null,null,null,null,null,null,null,null,null,null,null,null,null,null,null,null,null,null,null,null,null,null,null,69.849999999999994,"FBT 600","In/Out door","In/Out door","In/Out door",null,null,109,0,0,109,109,null,"FBT 600",1,0,0,0,0,0,0,0,0,1,1,1,"FBT 600"]
["M17/180 (LSRG-6)",0.25600000000000001,1.2600000000000001E-3,"N/A",{"$f":"((B110*SQRT($E$3*1000)+C110*$E$3*1000))/30480*Length*(1+'Cable Parameters'!I110/100*('Cable Parameters'!$E$1-25))+('Insertion Loss'!$F$16+'Insertion Loss'!$F$17)*SQRT($E$3)","v":0},1,85,-30,0.2,"http://www.eimfirst.co.il/wp-content/uploads/2018/09/low-smoke-shipbord-6-223.pdf",8.43,105,"M17/180 (LSRG-6)",null,110,110,110,110,110,110,"M17/180 (LSRG-6)",1,8.43,0,"N/A","Indoor Only","N/A",null,"M17/180 (LSRG-6)",1,1,1,1,1,1,1,1,1,1,1,1,1,1,1,1,1,1,1,1,1,1,1,1,1,1,1,null,1,null,false,false,false,false,false,false,null,null,{"$f":"ROW()","v":110},null,null,null,null,null,null,null,null,null,null,null,16686,null,8196,5525,null,null,null,null,null,1302,981,null,799,678,593,null,null,null,null,null,null,null,null,null,null,null,null,null,null,null,null,null,null,null,null,null,null,null,null,null,null,null,null,null,"N/A","M17/180 (LSRG-6)","Indoor Only",null,"Indoor Only",null,null,110,0,0,110,110,null,"M17/180 (LSRG-6)",1,0,1,0,1,0,0,0,0,1,1,1,"M17/180 (LSRG-6)"]
["M17/181 (LSRG-11)",0.20300000000000001,1.2600000000000001E-3,"N/A",{"$f":"((B111*SQRT($E$3*1000)+C111*$E$3*1000))/30480*Length*(1+'Cable Parameters'!I111/100*('Cable Parameters'!$E$1-25))+('Insertion Loss'!$F$16+'Insertion Loss'!$F$17)*SQRT($E$3)","v":0},1,85,-30,0.2,"http://www.eimfirst.co.il/wp-content/uploads/2018/09/low-smoke-shipbord-6-223.pdf",10.29,106,"M17/181 (LSRG-11)",null,111,111,111,111,111,111,"M17/181 (LSRG-11)",1,10.29,0,"N/A","Indoor Only","N/A",null,"M17/181 (LSRG-11)",1,1,1,1,1,1,1,1,1,1,1,1,1,1,1,1,1,1,1,1,1,1,1,1,1,1,1,null,1,null,false,false,false,false,false,false,null,null,{"$f":"ROW()","v":111},null,null,null,null,null,null,null,null,null,null,null,7230,null,3704,2582,null,null,null,null,null,741,588,null,497,435,390,null,null,null,null,null,null,null,null,null,null,null,null,null,null,null,null,null,null,null,null,null,null,null,null,null,null,null,null,null,"N/A","M17/181 (LSRG-11)","Indoor Only",null,"Indoor Only",null,null,111,0,0,111,111,null,"M17/181 (LSRG-11)",1,0,1,0,1,0,0,0,0,1,1,1,"M17/181 (LSRG-11)"]
["M17/183 (LSRG-58)",0.44400000000000001,1.2600000000000001E-3,"N/A",{"$f":"((B112*SQRT($E$3*1000)+C112*$E$3*1000))/30480*Length*(1+'Cable Parameters'!I112/100*('Cable Parameters'!$E$1-25))+('Insertion Loss'!$F$16+'Insertion Loss'!$F$17)*SQRT($E$3)","v":0},1,85,-30,0.2,"http://www.eimfirst.co.il/wp-content/uploads/2018/09/low-smoke-shipbord-6-223.pdf",4.95,107,"M17/183 (LSRG-58)",null,112,112,112,112,112,112,"M17/183 (LSRG-58)",1,4.95,0,"N/A","Indoor Only",30,null,"M17/183 (LSRG-58)",1,1,1,1,1,1,1,1,1,1,1,1,1,1,1,1,1,1,1,1,1,1,1,1,1,1,1,null,1,null,false,false,false,false,false,false,null,null,{"$f":"ROW()","v":112},null,null,null,null,null,null,null,null,null,null,null,16888,null,8295,5592,null,null,null,null,null,1317,993,null,808,687,600,null,null,null,null,null,null,null,null,null,null,null,null,null,null,null,null,null,null,null,null,null,null,null,null,null,null,null,null,null,30,"M17/183 (LSRG-58)","Indoor Only",null,"Indoor Only",null,null,112,0,0,112,112,null,"M17/183 (LSRG-58)",1,0,1,0,1,0,0,0,0,1,1,1,"M17/183 (LSRG-58)"]
["M17/190 (LSRG-214)",0.19,1.2600000000000001E-3,"N/A",{"$f":"((B113*SQRT($E$3*1000)+C113*$E$3*1000))/30480*Length*(1+'Cable Parameters'!I113/100*('Cable Parameters'!$E$1-25))+('Insertion Loss'!$F$16+'Insertion Loss'!$F$17)*SQRT($E$3)","v":0},11,85,-30,0.2,"http://www.eimfirst.co.il/wp-content/uploads/2018/09/low-smoke-shipbord-6-223.pdf",10.8,108,"M17/190 (LSRG-214)",null,113,113,113,113,113,113,"M17/190 (LSRG-214)",11,10.8,0,"N/A","Indoor Only",55,null,"M17/190 (LSRG-214)",1,1,1,1,1,1,1,1,1,1,1,1,1,1,1,1,1,1,1,1,1,1,1,1,1,1,1,null,1,null,false,false,false,false,false,false,null,null,{"$f":"ROW()","v":113},null,null,null,null,null,null,null,null,null,null,null,28800,null,14061,9434,null,null,null,null,null,2168,1625,null,1317,1115,971,null,null,null,null,null,null,null,null,null,null,null,null,null,null,null,null,null,null,null,null,null,null,null,null,null,null,null,null,null,55,"M17/190 (LSRG-214)","Indoor Only",null,"Indoor Only",null,null,113,0,0,113,113,null,"M17/190 (LSRG-214)",1,0,1,0,1,0,0,0,0,1,1,1,"M17/190 (LSRG-214)"]
["M17/194 (LSRG-223)",0.38400000000000001,1.2600000000000001E-3,"N/A",{"$f":"((B114*SQRT($E$3*1000)+C114*$E$3*1000))/30480*Length*(1+'Cable Parameters'!I114/100*('Cable Parameters'!$E$1-25))+('Insertion Loss'!$F$16+'Insertion Loss'!$F$17)*SQRT($E$3)","v":0},11,85,-30,0.2,"http://www.eimfirst.co.il/wp-content/uploads/2018/09/low-smoke-shipbord-6-223.pdf",5.38,109,"M17/194 (LSRG-223)",null,114,114,114,114,114,114,"M17/194 (LSRG-223)",11,5.38,0,"N/A","Indoor Only",30,null,"M17/194 (LSRG-223)",1,1,1,1,1,1,1,1,1,1,1,1,1,1,1,1,1,1,1,1,1,1,1,1,1,1,1,null,1,null,false,false,false,false,false,false,null,null,{"$f":"ROW()","v":114},null,null,null,null,null,null,null,null,null,null,null,19909,null,10158,7060,null,null,null,null,null,1985,1564,null,1317,1149,1027,null,null,null,null,null,null,null,null,null,null,null,null,null,null,null,null,null,null,null,null,null,null,null,null,null,null,null,null,null,30,"M17/194 (LSRG-223)","Indoor Only",null,"Indoor Only",null,null,114,0,0,114,114,null,"M17/194 (LSRG-223)",1,0,1,0,1,0,0,0,0,1,1,1,"M17/194 (LSRG-223)"]
["M17/220 (LLSB-200)",0.37752999999999998,3.8000000000000002E-4,"N/A",{"$f":"((B115*SQRT($E$3*1000)+C115*$E$3*1000))/30480*Length*(1+'Cable Parameters'!I115/100*('Cable Parameters'!$E$1-25))+('Insertion Loss'!$F$16+'Insertion Loss'!$F$17)*SQRT($E$3)","v":0},3,85,-30,0.2,"http://www.eimfirst.co.il/wp-content/uploads/2018/09/low-smoke-shipbord-200-1200.pdf",4.95,110,"M17/220 (LLSB-200)",null,115,115,115,115,115,115,"M17/220 (LLSB-200)",3,4.95,0,"N/A","Indoor Only",25.4,null,"M17/220 (LLSB-200)",1,1,1,1,1,1,1,1,1,1,1,1,1,1,1,1,1,1,1,1,1,1,1,1,1,1,1,null,1,null,false,false,false,false,false,false,null,null,{"$f":"ROW()","v":115},null,null,null,null,null,null,null,null,null,null,1718,null,980,753,525,null,250,null,null,null,149,null,null,null,null,null,null,null,null,null,null,null,null,null,null,null,null,null,null,null,null,null,null,null,null,null,null,null,null,null,null,null,null,null,null,25.4,"M17/220 (LLSB-200)","Indoor Only",null,"Indoor Only",null,null,115,0,0,115,115,null,"M17/220 (LLSB-200)",1,0,1,0,1,0,0,0,0,1,1,1,"M17/220 (LLSB-200)"]
["M17/221 (LLSB-240)",0.2848,3.8000000000000002E-4,"N/A",{"$f":"((B116*SQRT($E$3*1000)+C116*$E$3*1000))/30480*Length*(1+'Cable Parameters'!I116/100*('Cable Parameters'!$E$1-25))+('Insertion Loss'!$F$16+'Insertion Loss'!$F$17)*SQRT($E$3)","v":0},3,85,-30,0.2,"http://www.eimfirst.co.il/wp-content/uploads/2018/09/low-smoke-shipbord-200-1200.pdf",6.15,111,"M17/221 (LLSB-240)",null,116,116,116,116,116,116,"M17/221 (LLSB-240)",3,6.15,0,"N/A","Indoor Only",31.8,null,"M17/221 (LLSB-240)",1,1,1,1,1,1,1,1,1,1,1,1,1,1,1,1,1,1,1,1,1,1,1,1,1,1,1,null,1,null,false,false,false,false,false,false,null,null,{"$f":"ROW()","v":116},null,null,null,null,null,null,null,null,null,null,2477,null,1409,1081,751,null,353,null,null,null,209,null,null,null,null,null,null,null,null,null,null,null,null,null,null,null,null,null,null,null,null,null,null,null,null,null,null,null,null,null,null,null,null,null,null,31.8,"M17/221 (LLSB-240)","Indoor Only",null,"Indoor Only",null,null,116,0,0,116,116,null,"M17/221 (LLSB-240)",1,0,1,0,1,0,0,0,0,1,1,1,"M17/221 (LLSB-240)"]
["M17/223 (LLSB-400)",0.14387,3.0600000000000001E-4,"N/A",{"$f":"((B117*SQRT($E$3*1000)+C117*$E$3*1000))/30480*Length*(1+'Cable Parameters'!I117/100*('Cable Parameters'!$E$1-25))+('Insertion Loss'!$F$16+'Insertion Loss'!$F$17)*SQRT($E$3)","v":0},3,85,-30,0.2,"http://www.eimfirst.co.il/wp-content/uploads/2018/09/low-smoke-shipbord-200-1200.pdf",10.29,112,"M17/223 (LLSB-400)",null,117,117,117,117,117,117,"M17/223 (LLSB-400)",3,10.29,0,"N/A","Indoor Only",50.8,null,"M17/223 (LLSB-400)",1,1,1,1,1,1,1,1,1,1,1,1,1,1,1,1,1,1,1,1,1,1,1,1,1,1,1,null,1,null,false,false,false,false,false,false,null,null,{"$f":"ROW()","v":117},null,null,null,null,null,null,null,null,null,null,1436,null,822,634,444,null,215,null,null,null,131,null,null,null,null,null,null,null,null,null,null,null,null,null,null,null,null,null,null,null,null,null,null,null,null,null,null,null,null,null,null,null,null,null,null,50.8,"M17/223 (LLSB-400)","Indoor Only",null,"Indoor Only",null,null,117,0,0,117,117,null,"M17/223 (LLSB-400)",1,0,1,0,1,0,0,0,0,1,1,1,"M17/223 (LLSB-400)"]
["M17/225 (LLSB-600)",8.8880000000000001E-2,3.0600000000000001E-4,"N/A",{"$f":"((B118*SQRT($E$3*1000)+C118*$E$3*1000))/30480*Length*(1+'Cable Parameters'!I118/100*('Cable Parameters'!$E$1-25))+('Insertion Loss'!$F$16+'Insertion Loss'!$F$17)*SQRT($E$3)","v":0},3,85,-30,0.2,"http://www.eimfirst.co.il/wp-content/uploads/2018/09/low-smoke-shipbord-200-1200.pdf",14.99,113,"M17/225 (LLSB-600)",null,118,118,118,118,118,118,"M17/225 (LLSB-600)",3,14.99,0,"N/A","Indoor Only",76.2,null,"M17/225 (LLSB-600)",1,1,1,1,1,1,1,1,1,1,1,1,1,1,1,1,1,1,1,1,1,1,1,1,1,1,1,null,1,null,false,false,false,false,false,false,null,null,{"$f":"ROW()","v":118},null,null,null,null,null,null,null,null,null,null,3611,null,2053,1573,1091,null,512,null,null,null,302,null,null,null,null,null,null,null,null,null,null,null,null,null,null,null,null,null,null,null,null,null,null,null,null,null,null,null,null,null,null,null,null,null,null,76.2,"M17/225 (LLSB-600)","Indoor Only",null,"Indoor Only",null,null,118,0,0,118,118,null,"M17/225 (LLSB-600)",1,0,1,0,1,0,0,0,0,1,1,1,"M17/225 (LLSB-600)"]
["M17/226 (LLSB-900)",6.0909999999999999E-2,1.8799999999999999E-4,"N/A",{"$f":"((B119*SQRT($E$3*1000)+C119*$E$3*1000))/30480*Length*(1+'Cable Parameters'!I119/100*('Cable Parameters'!$E$1-25))+('Insertion Loss'!$F$16+'Insertion Loss'!$F$17)*SQRT($E$3)","v":0},3,85,-30,0.2,"http://www.eimfirst.co.il/wp-content/uploads/2018/09/low-smoke-shipbord-200-1200.pdf",22.1,114,"M17/226 (LLSB-900)",null,119,119,119,119,119,119,"M17/226 (LLSB-900)",3,22.1,0,"N/A","Indoor Only",114.3,null,"M17/226 (LLSB-900)",1,1,1,1,1,1,1,1,1,1,1,1,1,1,1,1,1,1,1,1,1,1,1,1,1,1,1,null,1,null,false,false,false,false,false,false,null,null,{"$f":"ROW()","v":119},null,null,null,null,null,null,null,null,null,null,1568,null,898,691,483,null,233,null,null,null,141,113,null,95,84,75,null,null,null,null,null,null,33,null,null,null,null,null,null,null,null,null,null,null,null,null,null,null,null,null,null,null,null,null,null,114.3,"M17/226 (LLSB-900)","Indoor Only",null,"Indoor Only",null,null,119,0,0,119,119,null,"M17/226 (LLSB-900)",1,0,1,0,1,0,0,0,0,1,1,1,"M17/226 (LLSB-900)"]
["M17/227 (LLSB-1200)",4.3959999999999999E-2,1.8799999999999999E-4,"N/A",{"$f":"((B120*SQRT($E$3*1000)+C120*$E$3*1000))/30480*Length*(1+'Cable Parameters'!I120/100*('Cable Parameters'!$E$1-25))+('Insertion Loss'!$F$16+'Insertion Loss'!$F$17)*SQRT($E$3)","v":0},3,85,-30,0.2,"http://www.eimfirst.co.il/wp-content/uploads/2018/09/low-smoke-shipbord-200-1200.pdf",30.48,115,"M17/227 (LLSB-1200)",null,120,120,120,120,120,120,"M17/227 (LLSB-1200)",3,30.48,0,"N/A","Indoor Only",152.4,null,"M17/227 (LLSB-1200)",1,1,1,1,1,1,1,1,1,1,1,1,1,1,1,1,1,1,1,1,1,1,1,1,1,1,1,null,1,null,false,false,false,false,false,false,null,null,{"$f":"ROW()","v":120},null,null,null,null,null,null,null,null,null,null,1459,null,840,649,457,null,225,null,null,null,140,113,null,97,86,78,null,null,null,null,null,null,null,null,null,null,null,null,null,null,null,null,null,null,null,null,null,null,null,null,null,null,null,null,null,152.4,"M17/227 (LLSB-1200)","Indoor Only",null,"Indoor Only",null,null,120,0,0,120,120,null,"M17/227 (LLSB-1200)",1,0,1,0,1,0,0,0,0,1,1,1,"M17/227 (LLSB-1200)"]
["TCOM-200-LS",0.37752999999999998,3.8000000000000002E-4,"N/A",{"$f":"((B121*SQRT($E$3*1000)+C121*$E$3*1000))/30480*Length*(1+'Cable Parameters'!I121/100*('Cable Parameters'!$E$1-25))+('Insertion Loss'!$F$16+'Insertion Loss'!$F$17)*SQRT($E$3)","v":0},10,100,-30,0.2,"http://www.eimfirst.co.il/wp-content/uploads/2018/09/tcom-low-smoke.pdf",4.95,116,"TCOM-200-LS",null,121,121,121,121,121,121,"TCOM-200-LS",10,4.95,0,"N/A","In/Out door",12.7,null,"TCOM-200-LS",1,1,1,1,1,1,1,1,1,1,1,1,1,1,1,1,1,1,1,1,1,1,1,1,1,1,1,null,1,null,false,false,false,false,false,false,null,null,{"$f":"ROW()","v":121},null,null,null,null,null,null,null,null,null,null,2205,null,1268,979,689,null,339,null,null,null,210,169,null,145,129,117,null,null,null,null,null,null,null,null,null,null,null,null,null,null,null,null,null,null,null,null,null,null,null,null,null,null,null,null,null,12.7,"TCOM-200-LS","In/Out door","In/Out door","In/Out door",null,null,121,0,0,121,121,null,"TCOM-200-LS",0,0,0,0,0,1,0,0,0,0,1,0,"TCOM-200-LS"]
["TCOM-240-LS",0.2848,3.8000000000000002E-4,"N/A",{"$f":"((B122*SQRT($E$3*1000)+C122*$E$3*1000))/30480*Length*(1+'Cable Parameters'!I122/100*('Cable Parameters'!$E$1-25))+('Insertion Loss'!$F$16+'Insertion Loss'!$F$17)*SQRT($E$3)","v":0},10,100,-30,0.2,"http://www.eimfirst.co.il/wp-content/uploads/2018/09/tcom-low-smoke.pdf",6.1,117,"TCOM-240-LS",null,122,122,122,122,122,122,"TCOM-240-LS",10,6.1,0,"N/A","In/Out door",19.100000000000001,null,"TCOM-240-LS",1,1,1,1,1,1,1,1,1,1,1,1,1,1,1,1,1,1,1,1,1,1,1,1,1,1,1,null,1,null,false,false,false,false,false,false,null,null,{"$f":"ROW()","v":122},null,null,null,null,null,null,null,null,null,null,4927,null,2830,2184,1534,null,750,null,null,null,462,371,null,318,281,254,null,null,null,null,null,null,null,null,null,null,null,null,null,null,null,null,null,null,null,null,null,null,null,null,null,null,null,null,null,19.100000000000001,"TCOM-240-LS","In/Out door","In/Out door","In/Out door",null,null,122,0,0,122,122,null,"TCOM-240-LS",0,0,0,0,0,1,0,0,0,0,1,0,"TCOM-240-LS"]
["TCOM-300-LS",0.2258,4.4000000000000002E-4,"N/A",{"$f":"((B123*SQRT($E$3*1000)+C123*$E$3*1000))/30480*Length*(1+'Cable Parameters'!I123/100*('Cable Parameters'!$E$1-25))+('Insertion Loss'!$F$16+'Insertion Loss'!$F$17)*SQRT($E$3)","v":0},10,100,-30,0.2,"http://www.eimfirst.co.il/wp-content/uploads/2018/09/tcom-low-smoke.pdf",7.62,118,"TCOM-300-LS",null,123,123,123,123,123,123,"TCOM-300-LS",10,7.62,0,"N/A","In/Out door",22.2,null,"TCOM-300-LS",1,1,1,1,1,1,1,1,1,1,1,1,1,1,1,1,1,1,1,1,1,1,1,1,1,1,1,null,1,null,false,false,false,false,false,false,null,null,{"$f":"ROW()","v":123},null,null,null,null,null,null,null,null,null,null,8172,null,4680,3605,2523,null,1219,null,null,null,742,592,null,503,443,398,null,null,null,null,null,null,null,null,null,null,null,null,null,null,null,null,null,null,null,null,null,null,null,null,null,null,null,null,null,22.2,"TCOM-300-LS","In/Out door","In/Out door","In/Out door",null,null,123,0,0,123,123,null,"TCOM-300-LS",0,0,0,0,0,1,0,0,0,0,1,0,"TCOM-300-LS"]
["TCOM-400-LS",0.14387,3.1E-4,"N/A",{"$f":"((B124*SQRT($E$3*1000)+C124*$E$3*1000))/30480*Length*(1+'Cable Parameters'!I124/100*('Cable Parameters'!$E$1-25))+('Insertion Loss'!$F$16+'Insertion Loss'!$F$17)*SQRT($E$3)","v":0},10,100,-30,0.2,"http://www.eimfirst.co.il/wp-content/uploads/2018/09/tcom-low-smoke.pdf",10.29,119,"TCOM-400-LS",null,124,124,124,124,124,124,"TCOM-400-LS",10,10.29,0,"N/A","In/Out door",25.4,null,"TCOM-400-LS",1,1,1,1,1,1,1,1,1,1,1,1,1,1,1,1,1,1,1,1,1,1,1,1,1,1,1,null,1,null,false,false,false,false,false,false,null,null,{"$f":"ROW()","v":124},null,null,null,null,null,null,null,null,null,null,13044,null,7477,5763,4038,null,1959,null,null,null,1197,958,null,815,718,647,null,null,null,null,null,null,null,null,null,null,null,null,null,null,null,null,null,null,null,null,null,null,null,null,null,null,null,null,null,25.4,"TCOM-400-LS","In/Out door","In/Out door","In/Out door",null,null,124,0,0,124,124,null,"TCOM-400-LS",0,0,0,0,0,1,0,0,0,0,1,0,"TCOM-400-LS"]
["TCOM-500-LS",0.13639999999999999,3.1E-4,"N/A",{"$f":"((B125*SQRT($E$3*1000)+C125*$E$3*1000))/30480*Length*(1+'Cable Parameters'!I125/100*('Cable Parameters'!$E$1-25))+('Insertion Loss'!$F$16+'Insertion Loss'!$F$17)*SQRT($E$3)","v":0},10,100,-30,0.2,"http://www.eimfirst.co.il/wp-content/uploads/2018/09/tcom-low-smoke.pdf",12.7,120,"TCOM-500-LS",null,125,125,125,125,125,125,"TCOM-500-LS",10,12.7,0,"N/A","In/Out door",31.8,null,"TCOM-500-LS",1,1,1,1,1,1,1,1,1,1,1,1,1,1,1,1,1,1,1,1,1,1,1,1,1,1,1,null,1,null,false,false,false,false,false,false,null,null,{"$f":"ROW()","v":125},null,null,null,null,null,null,null,null,null,null,18953,null,10835,8337,5823,null,2795,null,null,null,1689,1342,null,1137,998,895,null,null,null,null,null,null,null,null,null,null,null,null,null,null,null,null,null,null,null,null,null,null,null,null,null,null,null,null,null,31.8,"TCOM-500-LS","In/Out door","In/Out door","In/Out door",null,null,125,0,0,125,125,null,"TCOM-500-LS",0,0,0,0,0,1,0,0,0,0,1,0,"TCOM-500-LS"]
["TCOM-600-LS ",8.8880000000000001E-2,3.1E-4,"N/A",{"$f":"((B126*SQRT($E$3*1000)+C126*$E$3*1000))/30480*Length*(1+'Cable Parameters'!I126/100*('Cable Parameters'!$E$1-25))+('Insertion Loss'!$F$16+'Insertion Loss'!$F$17)*SQRT($E$3)","v":0},10,100,-30,0.2,"http://www.eimfirst.co.il/wp-content/uploads/2018/09/tcom-low-smoke.pdf",14.99,121,"TCOM-600-LS ",null,126,126,126,126,126,126,"TCOM-600-LS ",10,14.99,0,"N/A","In/Out door",38.1,null,"TCOM-600-LS ",1,1,1,1,1,1,1,1,1,1,1,1,1,1,1,1,1,1,1,1,1,1,1,1,1,1,1,null,1,null,false,false,false,false,false,false,null,null,{"$f":"ROW()","v":126},null,null,null,null,null,null,null,null,null,null,null,null,869,671,null,385,null,219,null,153,null,null,null,100,null,null,null,61,null,null,null,41,null,null,null,null,null,null,null,null,null,null,null,null,null,null,null,null,null,null,null,null,null,null,null,38.1,"TCOM-600-LS ","In/Out door","In/Out door","In/Out door",null,null,126,0,0,126,126,null,"TCOM-600-LS ",0,0,0,0,0,1,0,0,0,0,1,0,"TCOM-600-LS "]
["SPFLT 130",0.43630000000000002,1.4999999999999999E-4,"N/A",{"$f":"((B127*SQRT($E$3*1000)+C127*$E$3*1000))/30480*Length*(1+'Cable Parameters'!I127/100*('Cable Parameters'!$E$1-25))+('Insertion Loss'!$F$16+'Insertion Loss'!$F$17)*SQRT($E$3)","v":0},40,200,-65,0.2,"http://www.eimfirst.co.il/wp-content/uploads/2018/09/spflt-tm.pdf",3.3,122,"SPFLT 130",null,127,127,127,127,127,127,"SPFLT 130",40,3.3,0,"N/A","In/Out door",19.05,null,"SPFLT 130",1,1,1,1,1,1,1,1,1,1,1,1,1,1,1,1,1,1,1,1,1,1,1,1,1,1,1,null,1,null,false,false,false,false,false,false,null,null,{"$f":"ROW()","v":127},null,null,null,null,null,null,null,null,null,null,null,null,1268,979,null,561,null,319,null,222,null,null,null,145,null,null,null,88,null,null,null,59,null,null,null,null,null,null,null,null,null,null,null,null,null,null,null,null,null,null,null,null,null,null,null,19.05,"SPFLT 130","In/Out door","In/Out door","In/Out door",null,null,127,0,0,127,127,null,"SPFLT 130",0,1,0,0,0,0,0,0,0,0,0,0,"SPFLT 130"]
["SPFLT 200",0.24260000000000001,1.2999999999999999E-4,"N/A",{"$f":"((B128*SQRT($E$3*1000)+C128*$E$3*1000))/30480*Length*(1+'Cable Parameters'!I128/100*('Cable Parameters'!$E$1-25))+('Insertion Loss'!$F$16+'Insertion Loss'!$F$17)*SQRT($E$3)","v":0},30,200,-65,0.2,"http://www.eimfirst.co.il/wp-content/uploads/2018/09/spflt-tm.pdf",5.0999999999999996,123,"SPFLT 200",null,128,128,128,128,128,128,"SPFLT 200",30,5.0999999999999996,0,"N/A","In/Out door",25.4,null,"SPFLT 200",1,1,1,1,1,1,1,1,1,1,1,1,1,1,1,1,1,1,1,1,1,1,1,1,1,1,1,null,1,null,false,false,false,false,false,false,null,null,{"$f":"ROW()","v":128},null,null,null,null,null,null,null,null,null,null,null,null,1777,1371,null,783,null,443,null,307,null,null,null,200,null,null,null,120,null,null,null,80,null,null,null,null,null,null,null,null,null,null,null,null,null,null,null,null,null,null,null,null,null,null,null,25.4,"SPFLT 200","In/Out door","In/Out door","In/Out door",null,null,128,0,0,128,128,null,"SPFLT 200",0,1,0,0,0,0,0,0,0,0,0,0,"SPFLT 200"]
["SPFLT 305",0.13159999999999999,1.193E-4,"N/A",{"$f":"((B129*SQRT($E$3*1000)+C129*$E$3*1000))/30480*Length*(1+'Cable Parameters'!I129/100*('Cable Parameters'!$E$1-25))+('Insertion Loss'!$F$16+'Insertion Loss'!$F$17)*SQRT($E$3)","v":0},18.5,200,-65,0.2,"http://www.eimfirst.co.il/wp-content/uploads/2018/09/spflt-tm.pdf",7.8,124,"SPFLT 305",null,129,129,129,129,129,129,"SPFLT 305",18.5,7.8,0,"N/A","In/Out door",38.1,null,"SPFLT 305",1,1,1,1,1,1,1,1,1,1,1,1,1,1,1,1,1,1,1,1,1,1,1,1,1,1,1,null,1,null,false,false,false,false,false,false,null,null,{"$f":"ROW()","v":129},null,null,null,null,null,null,null,null,null,null,null,null,2830,2184,null,1246,null,705,null,489,null,null,null,318,null,null,null,190,null,null,null,126,null,null,null,null,null,null,null,null,null,null,null,null,null,null,null,null,null,null,null,null,null,null,null,38.1,"SPFLT 305","In/Out door","In/Out door","In/Out door",null,null,129,0,0,129,129,null,"SPFLT 305",0,1,0,0,0,0,0,0,0,0,0,0,"SPFLT 305"]
["HP-393",0.200595,1.2999999999999999E-3,"N/A",{"$f":"((B130*SQRT($E$3*1000)+C130*$E$3*1000))/30480*Length*(1+'Cable Parameters'!I130/100*('Cable Parameters'!$E$1-25))+('Insertion Loss'!$F$16+'Insertion Loss'!$F$17)*SQRT($E$3)","v":0},3,200,-55,0.2,"http://www.eimfirst.co.il/wp-content/uploads/2018/09/hp-cables.pdf",9.91,125,"HP-393",null,130,130,130,130,130,130,"HP-393",3,9.91,0,"N/A","In/Out door",50.8,null,"HP-393",1,1,1,1,1,1,1,1,1,1,1,1,1,1,1,1,1,1,1,1,1,1,1,1,1,1,1,null,1,null,false,false,false,false,false,false,null,null,{"$f":"ROW()","v":130},null,null,null,null,null,null,null,null,null,null,null,null,3752,2893,null,1647,null,928,null,641,null,null,null,413,null,null,null,245,null,null,null,161,null,null,null,null,null,null,null,null,null,null,null,null,null,null,null,null,null,null,null,null,null,null,null,50.8,"HP-393","In/Out door","In/Out door","In/Out door",null,null,130,0,0,130,130,null,"HP-393",0,0,0,0,0,0,0,0,0,1,0,1,"HP-393"]
["HP-226",0.16170000000000001,7.8299999999999995E-4,"N/A",{"$f":"((B131*SQRT($E$3*1000)+C131*$E$3*1000))/30480*Length*(1+'Cable Parameters'!I131/100*('Cable Parameters'!$E$1-25))+('Insertion Loss'!$F$16+'Insertion Loss'!$F$17)*SQRT($E$3)","v":0},3,200,-55,0.2,"http://www.eimfirst.co.il/wp-content/uploads/2018/09/hp-cables.pdf",12.32,126,"HP-226",null,131,131,131,131,131,131,"HP-226",3,12.32,0,"N/A","In/Out door",127,null,"HP-226",1,1,1,1,1,1,1,1,1,1,1,1,1,1,1,1,1,1,1,1,1,1,1,1,1,1,1,null,1,null,false,false,false,false,false,false,null,null,{"$f":"ROW()","v":131},null,null,null,null,null,null,null,null,null,null,null,null,4680,3605,null,2044,null,1145,null,786,null,null,null,503,null,null,null,294,null,null,null,191,null,null,null,null,null,null,null,null,null,null,null,null,null,null,null,null,null,null,null,null,null,null,null,127,"HP-226","In/Out door","In/Out door","In/Out door",null,null,131,0,0,131,131,null,"HP-226",0,0,0,0,0,0,0,0,0,1,0,1,"HP-226"]
["HP-600A",0.13100000000000001,1.17E-3,"N/A",{"$f":"((B132*SQRT($E$3*1000)+C132*$E$3*1000))/30480*Length*(1+'Cable Parameters'!I132/100*('Cable Parameters'!$E$1-25))+('Insertion Loss'!$F$16+'Insertion Loss'!$F$17)*SQRT($E$3)","v":0},3,200,-55,0.2,"http://www.eimfirst.co.il/wp-content/uploads/2018/09/hp-cables.pdf",14.99,127,"HP-600A",null,132,132,132,132,132,132,"HP-600A",3,14.99,0,"N/A","In/Out door",69.900000000000006,null,"HP-600A",1,1,1,1,1,1,1,1,1,1,1,1,1,1,1,1,1,1,1,1,1,1,1,1,1,1,1,null,1,null,false,false,false,false,false,false,null,null,{"$f":"ROW()","v":132},null,null,null,null,null,null,null,null,null,null,null,null,null,null,null,null,null,null,null,null,null,null,null,null,null,null,null,null,null,null,null,null,null,null,null,null,null,null,null,null,null,null,null,null,null,null,null,null,null,null,null,null,null,null,null,69.900000000000006,"HP-600A","In/Out door","In/Out door","In/Out door",null,null,132,0,0,132,132,null,"HP-600A",0,0,0,0,0,0,0,0,0,1,0,1,"HP-600A"]
["HP-218",9.1399999999999995E-2,1.83E-4,"N/A",{"$f":"((B133*SQRT($E$3*1000)+C133*$E$3*1000))/30480*Length*(1+'Cable Parameters'!I133/100*('Cable Parameters'!$E$1-25))+('Insertion Loss'!$F$16+'Insertion Loss'!$F$17)*SQRT($E$3)","v":0},3,200,-55,0.2,"http://www.eimfirst.co.il/wp-content/uploads/2018/09/hp-cables.pdf",19.940000000000001,128,"HP-218",null,133,133,133,133,133,133,"HP-218",3,19.940000000000001,0,"N/A","In/Out door",203,null,"HP-218",1,1,1,1,1,1,1,1,1,1,1,1,1,1,1,1,1,1,1,1,1,1,1,1,1,1,1,null,1,null,false,false,false,false,false,false,null,null,{"$f":"ROW()","v":133},null,null,null,null,null,null,null,null,null,null,null,null,null,null,null,null,null,null,null,null,null,null,null,null,null,null,null,null,null,null,null,null,null,null,null,null,null,null,null,null,null,null,null,null,null,null,null,null,null,null,null,null,null,null,null,203,"HP-218","In/Out door","In/Out door","In/Out door",null,null,133,0,0,133,133,null,"HP-218",0,0,0,0,0,0,0,0,0,1,0,1,"HP-218"]
["HP-900",5.722E-2,1.83E-4,"N/A",{"$f":"((B134*SQRT($E$3*1000)+C134*$E$3*1000))/30480*Length*(1+'Cable Parameters'!I134/100*('Cable Parameters'!$E$1-25))+('Insertion Loss'!$F$16+'Insertion Loss'!$F$17)*SQRT($E$3)","v":0},3,200,-55,0.2,"http://www.eimfirst.co.il/wp-content/uploads/2018/09/hp-cables.pdf",19.690000000000001,129,"HP-900",null,134,134,134,{"$f":"IF(Q134=\"\",\"\",IF($R$2=\"\",Q134,IF(OR(INDEX(A:WQ,ROW(),4)=$R$2,INDEX(A:WQ,ROW(),4)>$R$2),ROW(),\"\")))","v":134},134,134,"HP-900",3,19.690000000000001,0,"N/A",{"$f":"IF(ISERROR(IF($Q$2=\"\",INDEX(A:WQ,T134,128),IF($Q$2=1,INDEX(A:WQ,T134,126),INDEX(A:WQ,T134,127)))),\"\",IF($Q$2=\"\",INDEX(A:WQ,T134,128),IF($Q$2=1,INDEX(A:WQ,T134,126),INDEX(A:WQ,T134,127))))","v":"In/Out door"},{"$f":"IF(T134=\"\",\"\",INDEX(A:WQ,T134,124))","v":101.6},null,"HP-900",1,1,1,1,1,1,1,1,1,1,1,1,1,1,1,1,1,1,1,1,1,1,1,1,1,1,1,null,1,null,false,false,false,false,false,false,null,null,{"$f":"ROW()","v":134},null,null,null,null,null,null,null,null,null,null,null,null,null,null,null,null,null,null,null,null,null,null,null,null,null,null,null,null,null,null,null,null,null,null,null,null,null,null,null,null,null,null,null,null,null,null,null,null,null,null,null,null,null,null,null,101.6,"HP-900","In/Out door","In/Out door","In/Out door",null,null,134,0,0,134,134,null,"HP-900",0,0,0,0,0,0,0,0,0,1,0,1,"HP-900"]
["HP-1200",4.19E-2,1.8000000000000001E-4,"N/A",{"$f":"((B135*SQRT($E$3*1000)+C135*$E$3*1000))/30480*Length*(1+'Cable Parameters'!I135/100*('Cable Parameters'!$E$1-25))+('Insertion Loss'!$F$16+'Insertion Loss'!$F$17)*SQRT($E$3)","v":0},3,125,-40,0.2,"http://www.eimfirst.co.il/wp-content/uploads/2018/09/hp-cables.pdf",26.67,130,{"$f":"ET135","v":"HP-1200"},null,{"$f":"IF(M135=\"\",\"\",     IF($M$4=0,ROW(), IF(ISERROR(FIND($N$4,UPPER(A135))),\"\",ROW())))","v":135},{"$f":"IF(O135=\"\",\"\",IF($P$2=\"\",O135,IF(OR(INDEX(A:M,ROW(),6)=$P$2,INDEX(A:M,ROW(),6)>$P$2),ROW(),\"\")))","v":135},{"$f":"IF(P135=\"\",\"\",IF($Q$2=\"\",P135,IF(INDEX(DV:DW,ROW(),$Q$2)=\"\",\"\",ROW())))","v":135},135,{"$f":"IF(R135=\"\",\"\",IF($S$2=\"\",R135,IF(OR(INDEX(A:N,ROW(),11)>$S$2+1,INDEX(A:N,ROW(),11)<$S$2-1),\"\",ROW())))","v":135},135,{"$f":"IF(T135=\"\",\"\",INDEX(A:M,T135,1))","v":"HP-1200"},{"$f":"IF(T135=\"\",\"\",INDEX(A:N,T135,6))","v":3},{"$f":"IF(T135=\"\",\"\",INDEX(A:O,T135,11))","v":26.67},{"$f":"IF(T135=\"\",\"\",INDEX(A:P,T135,5))","v":0},{"$f":"IF(T135=\"\",\"\",INDEX(A:R,T135,4))","v":"N/A"},"In/Out door",203.2,null,{"$f":"A135","v":"HP-1200"},1,1,1,1,1,1,1,1,1,1,1,1,1,1,1,1,1,1,1,1,1,1,1,1,1,1,1,null,1,null,false,false,false,false,false,false,null,null,{"$f":"ROW()","v":135},null,null,null,null,null,null,null,null,null,null,null,18401,null,9389,6526,null,null,null,null,null,1836,1447,null,1218,1064,951,null,null,null,null,null,null,null,null,null,null,null,null,null,null,null,null,null,null,null,null,null,null,null,null,null,null,null,null,null,203.2,"HP-1200","In/Out door","In/Out door","In/Out door",null,null,{"$f":"IF(ISERROR(SMALL($S$6:$S$250,$L135)),\"\",SMALL($S$6:$S$250,$L135))","v":135},{"$f":"IF($EA135=\"\",\"\",IF(ISERROR(INDEX(A:EE,EA135,5)),EA135,INDEX(A:EE,EA135,5)))","v":0},{"$f":"IF(ISERROR(SMALL($EB$6:$EB$250,$L135)),\"\",SMALL($EB$6:$EB$250,$L135))","v":0},{"$f":"EA135","v":135},{"$f":"IF($P$2=\"\",EA135,VLOOKUP(EC135,$EB:$EE,3,FALSE))","v":135},null,{"$f":"A135","v":"HP-1200"},0,0,0,0,0,0,0,0,0,1,0,1,{"$f":"IF($ET$3=\"\",INDEX($A:$ES,ROW(),137),IF(INDEX($A:$ES,ROW(),$ET$3)=1,INDEX($A:$ES,ROW(),137),\"\"))","v":"HP-1200"}]
["HPL-393",0.22414000000000001,7.8299999999999995E-4,"N/A",{"$f":"((B136*SQRT($E$3*1000)+C136*$E$3*1000))/30480*Length*(1+'Cable Parameters'!I136/100*('Cable Parameters'!$E$1-25))+('Insertion Loss'!$F$16+'Insertion Loss'!$F$17)*SQRT($E$3)","v":0},3,125,-55,0.2,"http://www.eimfirst.co.il/wp-content/uploads/2018/09/HPL-CABLES.pdf",10.92,131,"HPL-393",null,136,136,136,136,136,{"$f":"EE136","v":136},"HPL-393",3,10.92,0,"N/A","In/Out door",57.2,null,"HPL-393",1,1,1,1,1,1,1,1,1,1,1,1,1,1,1,1,1,1,1,1,1,1,1,1,1,1,1,null,1,null,{"$f":"OR(AND(AD136=0,AE136=0,AF136=0,AG136=0,AH136=0),BF136=0)","v":false},{"$f":"OR(AND(AI136=0,AJ136=0,AK136=0,AL136=0,AM136=0),BF136=0)","v":false},{"$f":"OR(AND(AN136=0,AO136=0,AP136=0,AQ136=0,AR136=0),BF136=0)","v":false},{"$f":"OR(AND(AS136=0,AT136=0,AU136=0,AV136=0,AW136=0),BF136=0)","v":false},{"$f":"OR(AND(AX136=0,AY136=0,AZ136=0,BA136=0,BB136=0),BF136=0)","v":false},{"$f":"OR(AND(BC136=0,BD136=0),BF136=0)","v":false},null,null,{"$f":"ROW()","v":136},null,null,null,null,null,null,null,null,null,null,null,27153,null,13926,9720,null,null,null,null,null,2809,2231,null,1889,1657,1487,null,null,null,null,null,null,null,null,null,null,null,null,null,null,null,null,null,null,null,null,null,null,null,null,null,null,null,null,null,57.2,{"$f":"A136","v":"HPL-393"},"In/Out door","In/Out door","In/Out door",null,null,136,0,0,136,136,null,"HPL-393",0,0,0,0,0,0,0,0,0,1,0,1,"HPL-393"]
["HPL-226",0.15765999999999999,7.8299999999999995E-4,"N/A",{"$f":"((B137*SQRT($E$3*1000)+C137*$E$3*1000))/30480*Length*(1+'Cable Parameters'!I137/100*('Cable Parameters'!$E$1-25))+('Insertion Loss'!$F$16+'Insertion Loss'!$F$17)*SQRT($E$3)","v":0},3,125,-55,0.2,"http://www.eimfirst.co.il/wp-content/uploads/2018/09/HPL-CABLES.pdf",13.08,132,"HPL-226",null,137,137,137,137,137,137,"HPL-226",3,13.08,0,"N/A","In/Out door",69.900000000000006,null,"HPL-226",1,1,1,1,1,1,1,1,1,1,1,1,1,1,1,1,1,1,1,1,1,1,1,1,1,1,1,null,1,null,false,false,false,false,false,false,null,null,{"$f":"ROW()","v":137},null,null,null,null,null,null,null,null,null,null,null,32938,null,16674,11513,null,null,null,null,null,3106,2421,null,2020,1750,1554,null,null,null,null,null,null,null,null,null,null,null,null,null,null,null,null,null,null,null,null,null,null,null,null,null,null,null,null,null,69.900000000000006,"HPL-226","In/Out door","In/Out door","In/Out door",null,null,137,0,0,137,137,null,"HPL-226",0,0,0,0,0,0,0,0,0,1,0,1,"HPL-226"]
["HPL-600",0.13292000000000001,1.17E-3,"N/A",{"$f":"((B138*SQRT($E$3*1000)+C138*$E$3*1000))/30480*Length*(1+'Cable Parameters'!I138/100*('Cable Parameters'!$E$1-25))+('Insertion Loss'!$F$16+'Insertion Loss'!$F$17)*SQRT($E$3)","v":0},3,125,-55,0.2,"http://www.eimfirst.co.il/wp-content/uploads/2018/09/HPL-CABLES.pdf",15.49,133,"HPL-600",null,138,138,138,138,138,138,"HPL-600",3,15.49,0,"N/A","In/Out door",76.2,null,"HPL-600",1,1,1,1,1,1,1,1,1,1,1,1,1,1,1,1,1,1,1,1,1,1,1,1,1,1,1,null,1,null,false,false,false,false,false,false,null,null,{"$f":"ROW()","v":138},null,null,null,null,null,null,null,null,null,null,null,66034,null,34170,24030,null,null,null,null,null,7306,5891,null,5049,4476,4053,null,null,null,null,null,null,null,null,null,null,null,null,null,null,null,null,null,null,null,null,null,null,null,null,null,null,null,null,null,76.2,"HPL-600","In/Out door","In/Out door","In/Out door",null,null,138,0,0,138,138,null,"HPL-600",0,0,0,0,0,0,0,0,0,1,0,1,"HPL-600"]
["HPL-218",7.8589999999999993E-2,1.46E-4,"N/A",{"$f":"((B139*SQRT($E$3*1000)+C139*$E$3*1000))/30480*Length*(1+'Cable Parameters'!I139/100*('Cable Parameters'!$E$1-25))+('Insertion Loss'!$F$16+'Insertion Loss'!$F$17)*SQRT($E$3)","v":0},3,125,-55,0.2,"http://www.eimfirst.co.il/wp-content/uploads/2018/09/HPL-CABLES.pdf",21.46,134,"HPL-218",null,139,139,139,139,139,139,"HPL-218",3,21.46,0,"N/A","In/Out door",108,null,"HPL-218",1,1,1,1,1,1,1,1,1,1,1,1,1,1,1,1,1,1,1,1,1,1,1,1,1,1,1,null,1,null,false,false,false,false,false,false,null,null,{"$f":"ROW()","v":139},null,null,null,null,null,null,null,null,null,null,null,80110,null,41284,28932,null,null,null,null,null,8586,6872,null,5854,5162,4653,null,null,null,null,null,null,null,null,null,null,null,null,null,null,null,null,null,null,null,null,null,null,null,null,null,null,null,null,null,108,"HPL-218","In/Out door","In/Out door","In/Out door",null,null,139,0,0,139,139,null,"HPL-218",0,0,0,0,0,0,0,0,0,1,0,1,"HPL-218"]
["HPL-1200",6.7100000000000007E-2,1.83E-4,"N/A",{"$f":"((B140*SQRT($E$3*1000)+C140*$E$3*1000))/30480*Length*(1+'Cable Parameters'!I140/100*('Cable Parameters'!$E$1-25))+('Insertion Loss'!$F$16+'Insertion Loss'!$F$17)*SQRT($E$3)","v":0},3,125,-55,0.2,"http://www.eimfirst.co.il/wp-content/uploads/2018/09/HPL-CABLES.pdf",30.48,135,"HPL-1200",null,140,140,140,140,140,140,"HPL-1200",3,30.48,0,"N/A","In/Out door",228.6,null,"HPL-1200",1,1,1,1,1,1,1,1,1,1,1,1,1,1,1,1,1,1,1,1,1,1,1,1,1,1,1,null,1,null,false,false,false,false,false,false,null,null,{"$f":"ROW()","v":140},null,null,null,null,null,null,null,null,null,null,null,126762,null,65095,45482,null,null,null,null,null,13225,10521,null,8919,7831,7033,null,null,null,null,null,null,null,null,null,null,null,null,null,null,null,null,null,null,null,null,null,null,null,null,null,null,null,null,null,228.6,"HPL-1200","In/Out door","In/Out door","In/Out door",null,null,140,0,0,140,140,null,"HPL-1200",0,0,0,0,0,0,0,0,0,1,0,1,"HPL-1200"]
["HP-1200-PUR",4.1585999999999998E-2,1.85E-4,"N/A",{"$f":"((B141*SQRT($E$3*1000)+C141*$E$3*1000))/30480*Length*(1+'Cable Parameters'!I141/100*('Cable Parameters'!$E$1-25))+('Insertion Loss'!$F$16+'Insertion Loss'!$F$17)*SQRT($E$3)","v":0},3,105,-40,0.2,"http://www.eimfirst.co.il/wp-content/uploads/2018/09/Some-Other-Cables-1.pdf",30.48,136,"HP-1200-PUR",null,141,141,141,141,141,141,"HP-1200-PUR",3,30.48,0,"N/A","In/Out door",177.8,null,"HP-1200-PUR",1,1,1,1,1,1,1,1,1,1,1,1,1,1,1,1,1,1,1,1,1,1,1,1,1,1,1,null,1,null,false,false,false,false,false,false,null,null,{"$f":"ROW()","v":141},null,null,null,null,null,null,null,null,null,null,null,13663,null,7039,4932,null,null,null,null,null,1463,1171,null,998,880,793,null,null,null,null,null,null,null,null,null,null,null,null,null,null,null,null,null,null,null,null,null,null,null,null,null,null,null,null,null,177.8,"HP-1200-PUR","In/Out door","In/Out door","In/Out door",null,null,141,0,0,141,141,null,"HP-1200-PUR",0,0,0,0,0,0,0,0,0,1,0,1,"HP-1200-PUR"]
["HFlex-142",0.42923499999999998,9.859999999999999E-4,"N/A",{"$f":"((B142*SQRT($E$3*1000)+C142*$E$3*1000))/30480*Length*(1+'Cable Parameters'!I142/100*('Cable Parameters'!$E$1-25))+('Insertion Loss'!$F$16+'Insertion Loss'!$F$17)*SQRT($E$3)","v":0},3,200,-55,0.2,"http://www.eimfirst.co.il/wp-content/uploads/2018/09/Some-Other-Cables-1.pdf",4.32,137,"HFlex-142",null,142,142,142,142,142,142,"HFlex-142",3,4.32,0,"N/A","Indoor Only",38.1,null,"HFlex-142",1,1,1,1,1,1,1,1,1,1,1,1,1,1,1,1,1,1,1,1,1,1,1,1,1,1,1,null,1,null,false,false,false,false,false,false,null,null,{"$f":"ROW()","v":142},null,null,null,null,null,null,null,null,null,null,null,19232,null,9859,6879,null,null,null,null,null,1983,1574,null,1332,1168,1048,null,null,null,null,null,null,null,null,null,null,null,null,null,null,null,null,null,null,null,null,null,null,null,null,null,null,null,null,null,38.1,"HFlex-142","Indoor Only",null,{"$f":"DV142","v":"Indoor Only"},null,null,142,0,0,142,142,null,"HFlex-142",0,0,0,0,0,0,0,0,0,0,0,0,"HFlex-142"]
["SF- 316",0.70799999999999996,1.1999999999999999E-3,"N/A",{"$f":"((B143*SQRT($E$3*1000)+C143*$E$3*1000))/30480*Length*(1+'Cable Parameters'!I143/100*('Cable Parameters'!$E$1-25))+('Insertion Loss'!$F$16+'Insertion Loss'!$F$17)*SQRT($E$3)","v":0},18,200,-55,0.2,"https://www.eimfirst.co.il/wp-content/uploads/2019/01/StripFlex-1.pdf",2.79,138,"SF- 316",null,143,143,143,143,143,{"$f":"EE143","v":143},{"$f":"IF(T143=\"\",\"\",INDEX(A:M,T143,1))","v":"SF- 316"},{"$f":"IF(T143=\"\",\"\",INDEX(A:N,T143,6))","v":18},{"$f":"IF(T143=\"\",\"\",INDEX(A:O,T143,11))","v":2.79},{"$f":"IF(T143=\"\",\"\",INDEX(A:P,T143,5))","v":0},{"$f":"IF(T143=\"\",\"\",INDEX(A:R,T143,4))","v":"N/A"},"In/Out door",12.7,null,"SF- 316",1,1,1,1,1,1,1,1,1,1,1,1,1,1,1,1,1,1,1,1,1,1,1,1,1,1,1,null,1,null,{"$f":"OR(AND(AD143=0,AE143=0,AF143=0,AG143=0,AH143=0),BF143=0)","v":false},{"$f":"OR(AND(AI143=0,AJ143=0,AK143=0,AL143=0,AM143=0),BF143=0)","v":false},{"$f":"OR(AND(AN143=0,AO143=0,AP143=0,AQ143=0,AR143=0),BF143=0)","v":false},{"$f":"OR(AND(AS143=0,AT143=0,AU143=0,AV143=0,AW143=0),BF143=0)","v":false},{"$f":"OR(AND(AX143=0,AY143=0,AZ143=0,BA143=0,BB143=0),BF143=0)","v":false},{"$f":"OR(AND(BC143=0,BD143=0),BF143=0)","v":false},null,null,{"$f":"ROW()","v":143},null,null,null,null,null,null,null,null,null,null,null,null,null,null,null,null,null,null,null,null,null,null,null,null,null,null,null,null,null,null,null,null,null,null,null,null,null,null,null,null,null,null,null,null,null,null,null,null,null,null,null,null,null,null,null,12.7,"SF- 316","In/Out door","In/Out door","In/Out door",null,null,143,0,0,143,143,null,"SF- 316",1,0,0,0,0,0,0,0,0,0,0,0,"SF- 316"]
["SF- 142",0.34799999999999998,1.1999999999999999E-3,"N/A",{"$f":"((B144*SQRT($E$3*1000)+C144*$E$3*1000))/30480*Length*(1+'Cable Parameters'!I144/100*('Cable Parameters'!$E$1-25))+('Insertion Loss'!$F$16+'Insertion Loss'!$F$17)*SQRT($E$3)","v":0},18,200,-55,0.2,"https://www.eimfirst.co.il/wp-content/uploads/2019/01/StripFlex-1.pdf",4.95,139,"SF- 142",null,144,{"$f":"IF(O144=\"\",\"\",IF($P$2=\"\",O144,IF(OR(INDEX(A:M,ROW(),6)=$P$2,INDEX(A:M,ROW(),6)>$P$2),ROW(),\"\")))","v":144},{"$f":"IF(P144=\"\",\"\",IF($Q$2=\"\",P144,IF(INDEX(DV:DW,ROW(),$Q$2)=\"\",\"\",ROW())))","v":144},144,{"$f":"IF(R144=\"\",\"\",IF($S$2=\"\",R144,IF(OR(INDEX(A:N,ROW(),11)>$S$2+1,INDEX(A:N,ROW(),11)<$S$2-1),\"\",ROW())))","v":144},{"$f":"EE144","v":144},{"$f":"IF(T144=\"\",\"\",INDEX(A:M,T144,1))","v":"SF- 142"},{"$f":"IF(T144=\"\",\"\",INDEX(A:N,T144,6))","v":18},{"$f":"IF(T144=\"\",\"\",INDEX(A:O,T144,11))","v":4.95},{"$f":"IF(T144=\"\",\"\",INDEX(A:P,T144,5))","v":0},{"$f":"IF(T144=\"\",\"\",INDEX(A:R,T144,4))","v":"N/A"},"In/Out door",25.4,null,"SF- 142",1,1,1,1,1,1,1,1,1,1,1,1,1,1,1,1,1,1,1,1,1,1,1,1,1,1,1,null,1,null,false,false,false,false,false,false,null,null,{"$f":"ROW()","v":144},null,null,null,null,null,null,null,null,null,null,null,null,null,null,null,null,null,null,null,null,null,null,null,null,null,null,null,null,null,null,null,null,null,null,null,null,null,null,null,null,null,null,null,null,null,null,null,null,null,null,null,null,null,null,null,25.4,"SF- 142","In/Out door","In/Out door","In/Out door",null,null,144,0,0,144,144,null,"SF- 142",1,0,0,0,0,0,0,0,0,0,0,0,"SF- 142"]
["SF- 304",0.23100000000000001,1.1999999999999999E-3,"N/A",{"$f":"((B145*SQRT($E$3*1000)+C145*$E$3*1000))/30480*Length*(1+'Cable Parameters'!I145/100*('Cable Parameters'!$E$1-25))+('Insertion Loss'!$F$16+'Insertion Loss'!$F$17)*SQRT($E$3)","v":0},18,200,-55,0.2,"https://www.eimfirst.co.il/wp-content/uploads/2019/01/StripFlex-1.pdf",7.37,140,"SF- 304",null,145,145,145,145,145,145,"SF- 304",18,7.37,0,"N/A","In/Out door",38.1,null,"SF- 304",1,1,1,1,1,1,1,1,1,1,1,1,1,1,1,1,1,1,1,1,1,1,1,1,1,1,1,null,1,null,false,false,false,false,false,false,null,null,{"$f":"ROW()","v":145},null,null,null,null,null,null,null,null,null,null,null,null,null,null,null,null,null,null,null,null,null,null,null,null,null,null,null,null,null,null,null,null,null,null,null,null,null,null,null,null,null,null,null,null,null,null,null,null,null,null,null,null,null,null,null,38.1,"SF- 304","In/Out door","In/Out door","In/Out door",null,null,145,0,0,145,145,null,"SF- 304",1,0,0,0,0,0,0,0,0,0,0,0,"SF- 304"]
["SF- 214",0.17199999999999999,1.2600000000000001E-3,"N/A",{"$f":"((B146*SQRT($E$3*1000)+C146*$E$3*1000))/30480*Length*(1+'Cable Parameters'!I146/100*('Cable Parameters'!$E$1-25))+('Insertion Loss'!$F$16+'Insertion Loss'!$F$17)*SQRT($E$3)","v":0},13.5,80,-40,0.2,"https://www.eimfirst.co.il/wp-content/uploads/2019/01/StripFlex-1.pdf",10.8,141,"SF- 214",null,146,146,146,146,146,146,"SF- 214",13.5,10.8,0,"N/A","In/Out door",50.8,null,"SF- 214",1,1,1,1,1,1,1,1,1,1,1,1,1,1,1,1,1,1,1,1,1,1,1,1,1,1,1,null,1,null,false,false,false,false,false,false,null,null,{"$f":"ROW()","v":146},null,null,null,null,null,null,null,null,null,null,null,null,null,null,null,null,null,null,null,null,null,null,null,null,null,null,null,null,null,null,null,null,null,null,null,null,null,null,null,null,null,null,null,null,null,null,null,null,null,null,null,null,null,null,null,50.8,"SF- 214","In/Out door","In/Out door","In/Out door",null,null,146,0,0,146,146,null,"SF- 214",1,0,0,0,0,0,0,0,0,0,0,0,"SF- 214"]
["SF- 393",0.16400000000000001,1.1999999999999999E-3,"N/A",{"$f":"((B147*SQRT($E$3*1000)+C147*$E$3*1000))/30480*Length*(1+'Cable Parameters'!I147/100*('Cable Parameters'!$E$1-25))+('Insertion Loss'!$F$16+'Insertion Loss'!$F$17)*SQRT($E$3)","v":0},13.5,200,-55,0.2,"https://www.eimfirst.co.il/wp-content/uploads/2019/01/StripFlex-1.pdf",9.91,142,"SF- 393",null,147,147,147,147,147,147,"SF- 393",13.5,9.91,0,"N/A","In/Out door",50.8,null,"SF- 393",1,1,1,1,1,1,1,1,1,1,1,1,1,1,1,1,1,1,1,1,1,1,1,1,1,1,1,null,1,null,false,false,false,false,false,false,null,null,{"$f":"ROW()","v":147},null,null,null,null,null,null,null,null,null,null,null,null,null,null,null,null,null,null,null,null,null,null,null,null,null,null,null,null,null,null,null,null,null,null,null,null,null,null,null,null,null,null,null,null,null,null,null,null,null,null,null,null,null,null,null,50.8,"SF- 393","In/Out door","In/Out door","In/Out door",null,null,147,0,0,147,147,null,"SF- 393",1,0,0,0,0,0,0,0,0,0,0,0,"SF- 393"]
["TCOM-195",0.32101099999999999,4.6900000000000002E-4,"N/A",{"$f":"((B148*SQRT($E$3*1000)+C148*$E$3*1000))/30480*Length*(1+'Cable Parameters'!I148/100*('Cable Parameters'!$E$1-25))+('Insertion Loss'!$F$16+'Insertion Loss'!$F$17)*SQRT($E$3)","v":0},10,85,-40,0.2,"https://www.eimfirst.co.il/wp-content/uploads/2019/05/TCOM-195-RF-CABLE.pdf",4.95,143,"TCOM-195",null,148,148,148,148,148,148,"TCOM-195",10,4.95,0,"N/A","In/Out door",12.7,null,"TCOM-195",1,1,1,1,1,1,1,1,1,1,1,1,1,1,1,1,1,1,1,1,1,1,1,1,1,1,1,null,1,null,false,false,false,false,false,false,null,null,{"$f":"ROW()","v":148},null,null,null,null,null,null,null,null,null,null,null,null,null,null,null,null,null,null,null,null,null,null,null,null,null,null,null,null,null,null,null,null,null,null,null,null,null,null,null,null,null,null,null,null,null,null,null,null,null,null,null,null,null,null,null,12.7,"TCOM-195","In/Out door","In/Out door","In/Out door",null,null,148,0,0,148,148,null,"TCOM-195",0,0,0,0,0,1,0,0,0,0,1,0,"TCOM-195"]
["TCOM-200",0.30367,3.3100000000000002E-4,"N/A",{"$f":"((B149*SQRT($E$3*1000)+C149*$E$3*1000))/30480*Length*(1+'Cable Parameters'!I149/100*('Cable Parameters'!$E$1-25))+('Insertion Loss'!$F$16+'Insertion Loss'!$F$17)*SQRT($E$3)","v":0},10,85,-40,0.2,"https://www.eimfirst.co.il/wp-content/uploads/2019/05/TCOM-200-RF-CABLE.pdf",4.95,144,"TCOM-200",null,149,149,149,149,149,149,"TCOM-200",10,4.95,0,"N/A","In/Out door",12.7,null,"TCOM-200",1,1,1,1,1,1,1,1,1,1,1,1,1,1,1,1,1,1,1,1,1,1,1,1,1,1,1,null,1,null,false,false,false,false,false,false,null,null,{"$f":"ROW()","v":149},null,null,null,null,null,null,null,null,null,null,null,null,null,null,null,null,null,null,null,null,null,null,null,null,null,null,null,null,null,null,null,null,null,null,null,null,null,null,null,null,null,null,null,null,null,null,null,null,null,null,null,null,null,null,null,12.7,"TCOM-200","In/Out door","In/Out door","In/Out door",null,null,149,0,0,149,149,null,"TCOM-200",0,0,0,0,0,1,0,0,0,0,1,0,"TCOM-200"]
["TCOM-240",0.22914799999999999,3.3100000000000002E-4,"N/A",{"$f":"((B150*SQRT($E$3*1000)+C150*$E$3*1000))/30480*Length*(1+'Cable Parameters'!I150/100*('Cable Parameters'!$E$1-25))+('Insertion Loss'!$F$16+'Insertion Loss'!$F$17)*SQRT($E$3)","v":0},10,85,-40,0.2,"https://www.eimfirst.co.il/wp-content/uploads/2019/05/TCOM-240-RF-CABLE.pdf",6.1,145,"TCOM-240",null,150,150,150,150,150,150,"TCOM-240",10,6.1,0,"N/A","In/Out door",19.100000000000001,null,"TCOM-240",1,1,1,1,1,1,1,1,1,1,1,1,1,1,1,1,1,1,1,1,1,1,1,1,1,1,1,null,1,null,false,false,false,false,false,false,null,null,{"$f":"ROW()","v":150},null,null,null,null,null,null,null,null,null,null,null,null,null,null,null,null,null,null,null,null,null,null,null,null,null,null,null,null,null,null,null,null,null,null,null,null,null,null,null,null,null,null,null,null,null,null,null,null,null,null,null,null,null,null,null,19.100000000000001,"TCOM-240","In/Out door","In/Out door","In/Out door",null,null,150,0,0,150,150,null,"TCOM-240",0,0,0,0,0,1,0,0,0,0,1,0,"TCOM-240"]
["TCOM-300",0.19433700000000001,3.2699999999999998E-4,"N/A",{"$f":"((B151*SQRT($E$3*1000)+C151*$E$3*1000))/30480*Length*(1+'Cable Parameters'!I151/100*('Cable Parameters'!$E$1-25))+('Insertion Loss'!$F$16+'Insertion Loss'!$F$17)*SQRT($E$3)","v":0},10,85,-40,0.2,"https://www.eimfirst.co.il/wp-content/uploads/2019/05/TCOM-300-RF-CABLE.pdf",7.62,146,"TCOM-300",null,151,151,151,151,151,151,"TCOM-300",10,7.62,0,"N/A","In/Out door",22.2,null,"TCOM-300",1,1,1,1,1,1,1,1,1,1,1,1,1,1,1,1,1,1,1,1,1,1,1,1,1,1,1,null,1,null,false,false,false,false,false,false,null,null,{"$f":"ROW()","v":151},null,null,null,null,null,null,null,null,null,null,null,null,null,null,null,null,null,null,null,null,null,null,null,null,null,null,null,null,null,null,null,null,null,null,null,null,null,null,null,null,null,null,null,null,null,null,null,null,null,null,null,null,null,null,null,22.2,"TCOM-300","In/Out door","In/Out door","In/Out door",null,null,151,0,0,151,151,null,"TCOM-300",0,0,0,0,0,1,0,0,0,0,1,0,"TCOM-300"]
["TCOM-400",0.130555,2.6200000000000003E-4,"N/A",{"$f":"((B152*SQRT($E$3*1000)+C152*$E$3*1000))/30480*Length*(1+'Cable Parameters'!I152/100*('Cable Parameters'!$E$1-25))+('Insertion Loss'!$F$16+'Insertion Loss'!$F$17)*SQRT($E$3)","v":0},10,85,-40,0.2,"https://www.eimfirst.co.il/wp-content/uploads/2019/05/TCOM-400-RF-CABLE.pdf",10.29,147,"TCOM-400",null,152,152,152,152,152,152,"TCOM-400",10,10.29,0,"N/A","In/Out door",25.4,null,"TCOM-400",1,1,1,1,1,1,1,1,1,1,1,1,1,1,1,1,1,1,1,1,1,1,1,1,1,1,1,null,1,null,false,false,false,false,false,false,null,null,{"$f":"ROW()","v":152},null,null,null,null,null,null,null,null,null,null,null,null,null,null,null,null,null,null,null,null,null,null,null,null,null,null,null,null,null,null,null,null,null,null,null,null,null,null,null,null,null,null,null,null,null,null,null,null,null,null,null,null,null,null,null,25.4,"TCOM-400","In/Out door","In/Out door","In/Out door",null,null,152,0,0,152,152,null,"TCOM-400",0,0,0,0,0,1,0,0,0,0,1,0,"TCOM-400"]
["TCOM-500",0.10097200000000001,2.6200000000000003E-4,"N/A",{"$f":"((B153*SQRT($E$3*1000)+C153*$E$3*1000))/30480*Length*(1+'Cable Parameters'!I153/100*('Cable Parameters'!$E$1-25))+('Insertion Loss'!$F$16+'Insertion Loss'!$F$17)*SQRT($E$3)","v":0},10,85,-40,0.2,"https://www.eimfirst.co.il/wp-content/uploads/2019/05/TCOM-500-RF-CABLE.pdf",12.7,148,"TCOM-500",null,153,153,153,153,153,153,"TCOM-500",10,12.7,0,"N/A","In/Out door",31.8,null,"TCOM-500",1,1,1,1,1,1,1,1,1,1,1,1,1,1,1,1,1,1,1,1,1,1,1,1,1,1,1,null,1,null,false,false,false,false,false,false,null,null,{"$f":"ROW()","v":153},null,null,null,null,null,null,null,null,null,null,null,null,null,null,null,null,null,null,null,null,null,null,null,null,null,null,null,null,null,null,null,null,null,null,null,null,null,null,null,null,null,null,null,null,null,null,null,null,null,null,null,null,null,null,null,31.8,"TCOM-500","In/Out door","In/Out door","In/Out door",null,null,153,0,0,153,153,null,"TCOM-500",0,0,0,0,0,1,0,0,0,0,1,0,"TCOM-500"]
["TCOM-600",8.0074999999999993E-2,2.5599999999999999E-4,"N/A",{"$f":"((B154*SQRT($E$3*1000)+C154*$E$3*1000))/30480*Length*(1+'Cable Parameters'!I154/100*('Cable Parameters'!$E$1-25))+('Insertion Loss'!$F$16+'Insertion Loss'!$F$17)*SQRT($E$3)","v":0},10,85,-40,0.2,"https://www.eimfirst.co.il/wp-content/uploads/2019/05/TCOM-600-RF-CABLE.pdf",14.99,149,"TCOM-600",null,154,154,154,154,154,154,"TCOM-600",10,14.99,0,"N/A","In/Out door",38.1,null,"TCOM-600",1,1,1,1,1,1,1,1,1,1,1,1,1,1,1,1,1,1,1,1,1,1,1,1,1,1,1,null,1,null,false,false,false,false,false,false,null,null,{"$f":"ROW()","v":154},null,null,null,null,null,null,null,null,null,null,null,null,null,null,null,null,null,null,null,null,null,null,null,null,null,null,null,null,null,null,null,null,null,null,null,null,null,null,null,null,null,null,null,null,null,null,null,null,null,null,null,null,null,null,null,38.1,"TCOM-600","In/Out door","In/Out door","In/Out door",null,null,154,0,0,154,154,null,"TCOM-600",0,0,0,0,0,1,0,0,0,0,1,0,"TCOM-600"]
["M17/127-RG 393",0.20200000000000001,1.1999999999999999E-3,"N/A",{"$f":"((B155*SQRT($E$3*1000)+C155*$E$3*1000))/30480*Length*(1+'Cable Parameters'!I155/100*('Cable Parameters'!$E$1-25))+('Insertion Loss'!$F$16+'Insertion Loss'!$F$17)*SQRT($E$3)","v":0},11,200,-55,0.2,"https://www.eimfirst.co.il/wp-content/uploads/2019/02/MIL-C-17-RG-CABLES.pdf",9.91,150,"M17/127-RG 393",null,155,155,155,155,155,{"$f":"EE155","v":155},{"$f":"IF(T155=\"\",\"\",INDEX(A:M,T155,1))","v":"M17/127-RG 393"},{"$f":"IF(T155=\"\",\"\",INDEX(A:N,T155,6))","v":11},{"$f":"IF(T155=\"\",\"\",INDEX(A:O,T155,11))","v":9.91},{"$f":"IF(T155=\"\",\"\",INDEX(A:P,T155,5))","v":0},{"$f":"IF(T155=\"\",\"\",INDEX(A:R,T155,4))","v":"N/A"},"Indoor Only",49.55,null,"M17/127-RG 393",1,1,1,1,1,1,1,1,1,1,1,1,1,1,1,1,1,1,1,1,1,1,1,1,1,1,1,null,1,null,false,false,false,false,false,false,null,null,{"$f":"ROW()","v":155},null,null,null,null,null,null,null,null,null,null,null,null,null,null,null,null,null,null,null,null,null,null,null,null,null,null,null,null,null,null,null,null,null,null,null,null,null,null,null,null,null,null,null,null,null,null,null,null,null,null,null,null,null,null,null,49.55,"M17/127-RG 393","Indoor Only",null,"Indoor Only",null,null,155,0,0,155,155,null,"M17/127-RG 393",1,0,1,0,1,0,0,0,0,1,1,1,"M17/127-RG 393"]
["M17/78-RG 217",0.127,1.2600000000000001E-3,"N/A",{"$f":"((B156*SQRT($E$3*1000)+C156*$E$3*1000))/30480*Length*(1+'Cable Parameters'!I156/100*('Cable Parameters'!$E$1-25))+('Insertion Loss'!$F$16+'Insertion Loss'!$F$17)*SQRT($E$3)","v":0},3,85,-40,0.2,"https://www.eimfirst.co.il/wp-content/uploads/2019/02/MIL-C-17-RG-CABLES.pdf",13.84,151,"M17/78-RG 217",null,156,156,156,156,156,156,"M17/78-RG 217",3,13.84,0,"N/A","Indoor Only",69.2,null,"M17/78-RG 217",1,1,1,1,1,1,1,1,1,1,1,1,1,1,1,1,1,1,1,1,1,1,1,1,1,1,1,null,1,null,false,false,false,false,false,false,null,null,{"$f":"ROW()","v":156},null,null,null,null,null,null,null,null,null,null,null,null,null,null,null,null,null,null,null,null,null,null,null,null,null,null,null,null,null,null,null,null,null,null,null,null,null,null,null,null,null,null,null,null,null,null,null,null,null,null,null,null,null,null,null,69.2,"M17/78-RG 217","Indoor Only",null,"Indoor Only",null,null,156,0,0,156,156,null,"M17/78-RG 217",1,0,1,0,1,0,0,0,0,1,1,1,"M17/78-RG 217"]
["M17/67-RG 177",7.3999999999999996E-2,1.2600000000000001E-3,"N/A",{"$f":"((B157*SQRT($E$3*1000)+C157*$E$3*1000))/30480*Length*(1+'Cable Parameters'!I157/100*('Cable Parameters'!$E$1-25))+('Insertion Loss'!$F$16+'Insertion Loss'!$F$17)*SQRT($E$3)","v":0},5.6,85,-40,0.2,"https://www.eimfirst.co.il/wp-content/uploads/2019/02/MIL-C-17-RG-CABLES.pdf",22.73,152,"M17/67-RG 177",null,157,157,157,157,157,157,"M17/67-RG 177",5.6,22.73,0,"N/A","Indoor Only",113.65,null,"M17/67-RG 177",1,1,1,1,1,1,1,1,1,1,1,1,1,1,1,1,1,1,1,1,1,1,1,1,1,1,1,null,1,null,false,false,false,false,false,false,null,null,{"$f":"ROW()","v":157},null,null,null,null,null,null,null,null,null,null,null,null,null,null,null,null,null,null,null,null,null,null,null,null,null,null,null,null,null,null,null,null,null,null,null,null,null,null,null,null,null,null,null,null,null,null,null,null,null,null,null,null,null,null,null,113.65,"M17/67-RG 177","Indoor Only",null,"Indoor Only",null,null,157,0,0,157,157,null,"M17/67-RG 177",1,0,1,0,1,0,0,0,0,1,1,1,"M17/67-RG 177"]
["M17/79-RG 218",6.9000000000000006E-2,1.2600000000000001E-3,"N/A",{"$f":"((B158*SQRT($E$3*1000)+C158*$E$3*1000))/30480*Length*(1+'Cable Parameters'!I158/100*('Cable Parameters'!$E$1-25))+('Insertion Loss'!$F$16+'Insertion Loss'!$F$17)*SQRT($E$3)","v":0},1,85,-40,0.2,"https://www.eimfirst.co.il/wp-content/uploads/2019/02/MIL-C-17-RG-CABLES.pdf",22.1,153,"M17/79-RG 218",null,158,158,158,158,158,158,"M17/79-RG 218",1,22.1,0,"N/A","Indoor Only",110.5,null,"M17/79-RG 218",1,1,1,1,1,1,1,1,1,1,1,1,1,1,1,1,1,1,1,1,1,1,1,1,1,1,1,null,1,null,false,false,false,false,false,false,null,null,{"$f":"ROW()","v":158},null,null,null,null,null,null,null,null,null,null,null,null,null,null,null,null,null,null,null,null,null,null,null,null,null,null,null,null,null,null,null,null,null,null,null,null,null,null,null,null,null,null,null,null,null,null,null,null,null,null,null,null,null,null,null,110.5,"M17/79-RG 218","Indoor Only",null,"Indoor Only",null,null,158,0,0,158,158,null,"M17/79-RG 218",1,0,1,0,1,0,0,0,0,1,1,1,"M17/79-RG 218"]
["M17/28-RG 58",0.44400000000000001,1.2600000000000001E-3,"N/A",{"$f":"((B159*SQRT($E$3*1000)+C159*$E$3*1000))/30480*Length*(1+'Cable Parameters'!I159/100*('Cable Parameters'!$E$1-25))+('Insertion Loss'!$F$16+'Insertion Loss'!$F$17)*SQRT($E$3)","v":0},1,85,-40,0.2,"https://www.eimfirst.co.il/wp-content/uploads/2019/02/MIL-C-17-RG-CABLES.pdf",4.95,154,"M17/28-RG 58",null,159,{"$f":"IF(O159=\"\",\"\",IF($P$2=\"\",O159,IF(OR(INDEX(A:M,ROW(),6)=$P$2,INDEX(A:M,ROW(),6)>$P$2),ROW(),\"\")))","v":159},{"$f":"IF(P159=\"\",\"\",IF($Q$2=\"\",P159,IF(INDEX(DV:DW,ROW(),$Q$2)=\"\",\"\",ROW())))","v":159},{"$f":"IF(Q159=\"\",\"\",IF($R$2=\"\",Q159,IF(OR(INDEX(A:WQ,ROW(),4)=$R$2,INDEX(A:WQ,ROW(),4)>$R$2),ROW(),\"\")))","v":159},{"$f":"IF(R159=\"\",\"\",IF($S$2=\"\",R159,IF(OR(INDEX(A:N,ROW(),11)>$S$2+1,INDEX(A:N,ROW(),11)<$S$2-1),\"\",ROW())))","v":159},159,"M17/28-RG 58",1,4.95,0,"N/A","Indoor Only",24.75,null,"M17/28-RG 58",1,1,1,1,1,1,1,1,1,1,1,1,1,1,1,1,1,1,1,1,1,1,1,1,1,1,1,null,1,null,false,false,false,false,false,false,null,null,{"$f":"ROW()","v":159},null,null,null,null,null,null,null,null,null,null,null,null,null,null,null,null,null,null,null,null,null,null,null,null,null,null,null,null,null,null,null,null,null,null,null,null,null,null,null,null,null,null,null,null,null,null,null,null,null,null,null,null,null,null,null,24.75,"M17/28-RG 58","Indoor Only",null,"Indoor Only",null,null,159,0,0,159,159,null,"M17/28-RG 58",1,0,1,0,1,0,0,0,0,1,1,1,"M17/28-RG 58"]
["T-RAD™-400",0.18228759999999999,4.4959999999999998E-4,"N/A",{"$f":"((B160*SQRT($E$3*1000)+C160*$E$3*1000))/30480*Length*(1+'Cable Parameters'!I160/100*('Cable Parameters'!$E$1-25))+('Insertion Loss'!$F$16+'Insertion Loss'!$F$17)*SQRT($E$3)","v":0},2.5,85,-40,0.2,"https://www.eimfirst.co.il/wp-content/uploads/2019/01/Radiating-Cable.pdf",8.89,155,"T-RAD™-400",null,160,160,160,160,160,160,"T-RAD™-400",2.5,8.89,0,"N/A","In/Out door",38,null,"T-RAD™-400",1,1,1,1,1,1,1,1,1,1,1,1,1,1,1,1,1,1,1,1,1,1,1,1,1,1,1,null,1,null,false,false,false,false,false,false,null,null,{"$f":"ROW()","v":160},null,null,null,null,null,null,null,null,null,null,null,null,null,null,null,null,null,null,null,null,null,null,null,null,null,null,null,null,null,null,null,null,null,null,null,null,null,null,null,null,null,null,null,null,null,null,null,null,null,null,null,null,null,null,null,38,"T-RAD™-400","In/Out door","In/Out door","In/Out door",null,null,160,0,0,160,160,null,"T-RAD™-400",0,0,1,0,0,0,0,0,0,0,1,0,"T-RAD™-400"]
["T-RAD™-600",0.10465099999999999,3.8860000000000001E-4,"N/A",{"$f":"((B161*SQRT($E$3*1000)+C161*$E$3*1000))/30480*Length*(1+'Cable Parameters'!I161/100*('Cable Parameters'!$E$1-25))+('Insertion Loss'!$F$16+'Insertion Loss'!$F$17)*SQRT($E$3)","v":0},2.5,85,-40,0.2,"https://www.eimfirst.co.il/wp-content/uploads/2019/01/Radiating-Cable.pdf",13.46,156,"T-RAD™-600",null,161,161,161,161,161,161,"T-RAD™-600",2.5,13.46,0,"N/A","In/Out door",38,null,"T-RAD™-600",1,1,1,1,1,1,1,1,1,1,1,1,1,1,1,1,1,1,1,1,1,1,1,1,1,1,1,null,1,null,false,false,false,false,false,false,null,null,{"$f":"ROW()","v":161},null,null,null,null,null,null,null,null,null,null,null,null,null,null,null,null,null,null,null,null,null,null,null,null,null,null,null,null,null,null,null,null,null,null,null,null,null,null,null,null,null,null,null,null,null,null,null,null,null,null,null,null,null,null,null,38,"T-RAD™-600","In/Out door","In/Out door","In/Out door",null,null,161,0,0,161,161,null,"T-RAD™-600",0,0,1,0,0,0,0,0,0,0,1,0,"T-RAD™-600"]
["T-RAD™-900",7.0345099999999994E-2,1.2300000000000001E-4,"N/A",{"$f":"((B162*SQRT($E$3*1000)+C162*$E$3*1000))/30480*Length*(1+'Cable Parameters'!I162/100*('Cable Parameters'!$E$1-25))+('Insertion Loss'!$F$16+'Insertion Loss'!$F$17)*SQRT($E$3)","v":0},2.5,85,-40,0.2,"https://www.eimfirst.co.il/wp-content/uploads/2019/01/Radiating-Cable.pdf",22.1,157,"T-RAD™-900",null,162,162,162,162,162,162,"T-RAD™-900",2.5,22.1,0,"N/A","In/Out door",76.2,null,"T-RAD™-900",1,1,1,1,1,1,1,1,1,1,1,1,1,1,1,1,1,1,1,1,1,1,1,1,1,1,1,null,1,null,false,false,false,false,false,false,null,null,{"$f":"ROW()","v":162},null,null,null,null,null,null,null,null,null,null,null,null,null,null,null,null,null,null,null,null,null,null,null,null,null,null,null,null,null,null,null,null,null,null,null,null,null,null,null,null,null,null,null,null,null,null,null,null,null,null,null,null,null,null,null,76.2,"T-RAD™-900","In/Out door","In/Out door","In/Out door",null,null,162,0,0,162,162,null,"T-RAD™-900",0,0,1,0,0,0,0,0,0,0,1,0,"T-RAD™-900"]
["nu-TRAC® TRC-875",3.3050799999999998E-2,7.6809999999999997E-4,"N/A",{"$f":"((B163*SQRT($E$3*1000)+C163*$E$3*1000))/30480*Length*(1+'Cable Parameters'!I163/100*('Cable Parameters'!$E$1-25))+('Insertion Loss'!$F$16+'Insertion Loss'!$F$17)*SQRT($E$3)","v":0},2.4,85,-40,0.2,"https://www.eimfirst.co.il/wp-content/uploads/2019/01/Radiating-Cable.pdf",30.5,158,"nu-TRAC® TRC-875",null,163,163,163,163,163,163,"nu-TRAC® TRC-875",2.4,30.5,0,"N/A","In/Out door",165,null,"nu-TRAC® TRC-875",1,1,1,1,1,1,1,1,1,1,1,1,1,1,1,1,1,1,1,1,1,1,1,1,1,1,1,null,1,null,false,false,false,false,false,false,null,null,{"$f":"ROW()","v":163},null,null,null,null,null,null,null,null,null,null,null,null,null,null,null,null,null,null,null,null,null,null,null,null,null,null,null,null,null,null,null,null,null,null,null,null,null,null,null,null,null,null,null,null,null,null,null,null,null,null,null,null,null,null,null,165,"nu-TRAC® TRC-875","In/Out door","In/Out door","In/Out door",null,null,163,0,0,163,163,null,"nu-TRAC® TRC-875",0,0,1,0,0,0,0,0,0,0,1,0,"nu-TRAC® TRC-875"]
["nu-TRAC® TRC-1250",2.6805200000000001E-2,4.1140000000000003E-4,"N/A",{"$f":"((B164*SQRT($E$3*1000)+C164*$E$3*1000))/30480*Length*(1+'Cable Parameters'!I164/100*('Cable Parameters'!$E$1-25))+('Insertion Loss'!$F$16+'Insertion Loss'!$F$17)*SQRT($E$3)","v":0},2.4,85,-40,0.2,"https://www.eimfirst.co.il/wp-content/uploads/2019/01/Radiating-Cable.pdf",42.4,159,"nu-TRAC® TRC-1250",null,164,164,164,164,164,164,"nu-TRAC® TRC-1250",2.4,42.4,0,"N/A","In/Out door",342,null,"nu-TRAC® TRC-1250",1,1,1,1,1,1,1,1,1,1,1,1,1,1,1,1,1,1,1,1,1,1,1,1,1,1,1,null,1,null,false,false,false,false,false,false,null,null,{"$f":"ROW()","v":164},null,null,null,null,null,null,null,null,null,null,null,null,null,null,null,null,null,null,null,null,null,null,null,null,null,null,null,null,null,null,null,null,null,null,null,null,null,null,null,null,null,null,null,null,null,null,null,null,null,null,null,null,null,null,null,342,"nu-TRAC® TRC-1250","In/Out door","In/Out door","In/Out door",null,null,164,0,0,164,164,null,"nu-TRAC® TRC-1250",0,0,1,0,0,0,0,0,0,0,1,0,"nu-TRAC® TRC-1250"]
["SPO-250",0.1842493,4.2549999999999999E-4,"N/A",{"$f":"((B165*SQRT($E$3*1000)+C165*$E$3*1000))/30480*Length*(1+'Cable Parameters'!I165/100*('Cable Parameters'!$E$1-25))+('Insertion Loss'!$F$16+'Insertion Loss'!$F$17)*SQRT($E$3)","v":0},5.8,85,-40,0.2,"https://www.eimfirst.co.il/wp-content/uploads/2019/01/SPO-CABLE-ASSEMBLY.pdf",7.7,160,"SPO-250",null,165,165,165,165,165,165,"SPO-250",5.8,7.7,0,"N/A","In/Out door",25,null,"SPO-250",1,1,1,1,1,1,1,1,1,1,1,1,1,1,1,1,1,1,1,1,1,1,1,1,1,1,1,null,1,null,false,false,false,false,false,false,null,null,{"$f":"ROW()","v":165},null,null,null,null,null,null,null,null,null,null,null,null,null,null,null,null,null,null,null,null,null,null,null,null,null,null,null,null,null,null,null,null,null,null,null,null,null,null,null,null,null,null,null,null,null,null,null,null,null,null,null,null,null,null,null,25,"SPO-250","In/Out door","In/Out door","In/Out door",null,null,165,0,0,165,165,null,"SPO-250",0,0,0,0,0,0,0,0,0,0,1,1,"SPO-250"]
["SPO-375",0.1241472,3.6989999999999999E-4,"N/A",{"$f":"((B166*SQRT($E$3*1000)+C166*$E$3*1000))/30480*Length*(1+'Cable Parameters'!I166/100*('Cable Parameters'!$E$1-25))+('Insertion Loss'!$F$16+'Insertion Loss'!$F$17)*SQRT($E$3)","v":0},5.8,85,-40,0.2,"https://www.eimfirst.co.il/wp-content/uploads/2019/01/SPO-CABLE-ASSEMBLY.pdf",10.8,161,"SPO-375",null,166,166,166,{"$f":"IF(Q166=\"\",\"\",IF($R$2=\"\",Q166,IF(OR(INDEX(A:WQ,ROW(),4)=$R$2,INDEX(A:WQ,ROW(),4)>$R$2),ROW(),\"\")))","v":166},166,166,"SPO-375",5.8,10.8,0,"N/A",{"$f":"IF(ISERROR(IF($Q$2=\"\",INDEX(A:WQ,T166,128),IF($Q$2=1,INDEX(A:WQ,T166,126),INDEX(A:WQ,T166,127)))),\"\",IF($Q$2=\"\",INDEX(A:WQ,T166,128),IF($Q$2=1,INDEX(A:WQ,T166,126),INDEX(A:WQ,T166,127))))","v":"In/Out door"},{"$f":"IF(T166=\"\",\"\",INDEX(A:WQ,T166,124))","v":2.2999999999999998},null,"SPO-375",1,1,1,1,1,1,1,1,1,1,1,1,1,1,1,1,1,1,1,1,1,1,1,1,1,1,1,null,1,null,false,false,false,false,false,false,null,null,{"$f":"ROW()","v":166},null,null,null,null,null,null,null,null,null,null,null,null,null,null,null,null,null,null,null,null,null,null,null,null,null,null,null,null,null,null,null,null,null,null,null,null,null,null,null,null,null,null,null,null,null,null,null,null,null,null,null,null,null,null,null,2.2999999999999998,"SPO-375","In/Out door","In/Out door","In/Out door",null,null,166,0,0,166,166,null,"SPO-375",0,0,0,0,0,0,0,0,0,0,1,1,"SPO-375"]
["SPO-500",8.8491500000000001E-2,7.1739999999999998E-4,"N/A",{"$f":"((B167*SQRT($E$3*1000)+C167*$E$3*1000))/30480*Length*(1+'Cable Parameters'!I167/100*('Cable Parameters'!$E$1-25))+('Insertion Loss'!$F$16+'Insertion Loss'!$F$17)*SQRT($E$3)","v":0},5.8,85,-40,0.2,"https://www.eimfirst.co.il/wp-content/uploads/2019/01/SPO-CABLE-ASSEMBLY.pdf",13.4,162,"SPO-500",null,167,167,167,167,167,167,"SPO-500",5.8,13.4,0,"N/A","In/Out door",51,null,"SPO-500",1,1,1,1,1,1,1,1,1,1,1,1,1,1,1,1,1,1,1,1,1,1,1,1,1,1,1,null,1,null,false,false,false,false,false,false,null,null,{"$f":"ROW()","v":167},null,null,null,null,null,null,null,null,null,null,null,null,null,null,null,null,null,null,null,null,null,null,null,null,null,null,null,null,null,null,null,null,null,null,null,null,null,null,null,null,null,null,null,null,null,null,null,null,null,null,null,null,null,null,null,51,"SPO-500","In/Out door","In/Out door","In/Out door",null,null,167,0,0,167,167,null,"SPO-500",0,0,0,0,0,0,0,0,0,0,1,1,"SPO-500"]
["SPF-250",0.1842493,4.2549999999999999E-4,"N/A",{"$f":"((B168*SQRT($E$3*1000)+C168*$E$3*1000))/30480*Length*(1+'Cable Parameters'!I168/100*('Cable Parameters'!$E$1-25))+('Insertion Loss'!$F$16+'Insertion Loss'!$F$17)*SQRT($E$3)","v":0},5.8,85,-40,0.2,"https://www.eimfirst.co.il/wp-content/uploads/2019/01/SPF.pdf",7.7,163,"SPF-250",null,168,168,168,168,168,168,"SPF-250",5.8,7.7,0,"N/A","Indoor Only",25,null,"SPF-250",1,1,1,1,1,1,1,1,1,1,1,1,1,1,1,1,1,1,1,1,1,1,1,1,1,1,1,null,1,null,false,false,false,false,false,false,null,null,{"$f":"ROW()","v":168},null,null,null,null,null,null,null,null,null,null,null,null,null,null,null,null,null,null,null,null,null,null,null,null,null,null,null,null,null,null,null,null,null,null,null,null,null,null,null,null,null,null,null,null,null,null,null,null,null,null,null,null,null,null,null,25,"SPF-250","Indoor Only",null,"Indoor Only",null,null,168,0,0,168,168,null,"SPF-250",0,0,0,0,0,0,0,0,0,0,1,0,"SPF-250"]
["SPF-375",0.1241472,3.6989999999999999E-4,"N/A",{"$f":"((B169*SQRT($E$3*1000)+C169*$E$3*1000))/30480*Length*(1+'Cable Parameters'!I169/100*('Cable Parameters'!$E$1-25))+('Insertion Loss'!$F$16+'Insertion Loss'!$F$17)*SQRT($E$3)","v":0},5.8,85,-40,0.2,"https://www.eimfirst.co.il/wp-content/uploads/2019/01/SPF.pdf",10.8,164,"SPF-375",null,169,169,169,169,169,169,"SPF-375",5.8,10.8,0,"N/A","Indoor Only",2.2999999999999998,null,"SPF-375",1,1,1,1,1,1,1,1,1,1,1,1,1,1,1,1,1,1,1,1,1,1,1,1,1,1,1,null,1,null,false,false,false,false,false,false,null,null,{"$f":"ROW()","v":169},null,null,null,null,null,null,null,null,null,null,null,null,null,null,null,null,null,null,null,null,null,null,null,null,null,null,null,null,null,null,null,null,null,null,null,null,null,null,null,null,null,null,null,null,null,null,null,null,null,null,null,null,null,null,null,2.2999999999999998,"SPF-375","Indoor Only",null,"Indoor Only",null,null,169,0,0,169,169,null,"SPF-375",0,0,0,0,0,0,0,0,0,0,1,0,"SPF-375"]
["SPF-500",8.8491500000000001E-2,7.1739999999999998E-4,"N/A",{"$f":"((B170*SQRT($E$3*1000)+C170*$E$3*1000))/30480*Length*(1+'Cable Parameters'!I170/100*('Cable Parameters'!$E$1-25))+('Insertion Loss'!$F$16+'Insertion Loss'!$F$17)*SQRT($E$3)","v":0},5.8,85,-40,0.2,"https://www.eimfirst.co.il/wp-content/uploads/2019/01/SPF.pdf",13.4,165,"SPF-500",null,170,170,170,170,170,170,"SPF-500",5.8,13.4,0,"N/A","Indoor Only",51,null,"SPF-500",1,1,1,1,1,1,1,1,1,1,1,1,1,1,1,1,1,1,1,1,1,1,1,1,1,1,1,null,1,null,false,false,false,false,false,false,null,null,{"$f":"ROW()","v":170},null,null,null,null,null,null,null,null,null,null,null,null,null,null,null,null,null,null,null,null,null,null,null,null,null,null,null,null,null,null,null,null,null,null,null,null,null,null,null,null,null,null,null,null,null,null,null,null,null,null,null,null,null,null,null,51,"SPF-500","Indoor Only",null,"Indoor Only",null,null,170,0,0,170,170,null,"SPF-500",0,0,0,0,0,0,0,0,0,0,1,0,"SPF-500"]
["SPP-250-LLPL",0.17326530000000001,2.766E-4,"N/A",{"$f":"((B171*SQRT($E$3*1000)+C171*$E$3*1000))/30480*Length*(1+'Cable Parameters'!I171/100*('Cable Parameters'!$E$1-25))+('Insertion Loss'!$F$16+'Insertion Loss'!$F$17)*SQRT($E$3)","v":0},5.8,200,-55,0.2,"https://www.eimfirst.co.il/wp-content/uploads/2019/01/SPP.pdf",7.1,166,"SPP-250-LLPL",null,171,171,171,171,171,171,"SPP-250-LLPL",5.8,7.1,0,"N/A","In/Out door",32,null,"SPP-250-LLPL",1,1,1,1,1,1,1,1,1,1,1,1,1,1,1,1,1,1,1,1,1,1,1,1,1,1,1,null,1,null,false,false,false,false,false,false,null,null,{"$f":"ROW()","v":171},null,null,null,null,null,null,null,null,null,null,null,null,null,null,null,null,null,null,null,null,null,null,null,null,null,null,null,null,null,null,null,null,null,null,null,null,null,null,null,null,null,null,null,null,null,null,null,null,null,null,null,null,null,null,null,32,"SPP-250-LLPL","In/Out door","In/Out door","In/Out door",null,null,171,0,0,171,171,null,"SPP-250-LLPL",0,0,0,0,0,0,0,0,0,0,1,1,"SPP-250-LLPL"]
["SPP-375-LLPL",0.1111354,3.166E-4,"N/A",{"$f":"((B172*SQRT($E$3*1000)+C172*$E$3*1000))/30480*Length*(1+'Cable Parameters'!I172/100*('Cable Parameters'!$E$1-25))+('Insertion Loss'!$F$16+'Insertion Loss'!$F$17)*SQRT($E$3)","v":0},5.8,200,-55,0.2,"https://www.eimfirst.co.il/wp-content/uploads/2019/01/SPP.pdf",10.199999999999999,167,"SPP-375-LLPL",null,172,172,172,172,172,172,"SPP-375-LLPL",5.8,10.199999999999999,0,"N/A","In/Out door",35,null,"SPP-375-LLPL",1,1,1,1,1,1,1,1,1,1,1,1,1,1,1,1,1,1,1,1,1,1,1,1,1,1,1,null,1,null,false,false,false,false,false,false,null,null,{"$f":"ROW()","v":172},null,null,null,null,null,null,null,null,null,null,null,null,null,null,null,null,null,null,null,null,null,null,null,null,null,null,null,null,null,null,null,null,null,null,null,null,null,null,null,null,null,null,null,null,null,null,null,null,null,null,null,null,null,null,null,35,"SPP-375-LLPL","In/Out door","In/Out door","In/Out door",null,null,172,0,0,172,172,null,"SPP-375-LLPL",0,0,0,0,0,0,0,0,0,0,1,1,"SPP-375-LLPL"]
["SPP-500-LLPL",0.10364379999999999,2.253E-4,"N/A",{"$f":"((B173*SQRT($E$3*1000)+C173*$E$3*1000))/30480*Length*(1+'Cable Parameters'!I173/100*('Cable Parameters'!$E$1-25))+('Insertion Loss'!$F$16+'Insertion Loss'!$F$17)*SQRT($E$3)","v":0},5.8,200,-55,0.2,"https://www.eimfirst.co.il/wp-content/uploads/2019/01/SPP.pdf",13.4,168,"SPP-500-LLPL",null,173,173,173,173,173,173,"SPP-500-LLPL",5.8,13.4,0,"N/A","In/Out door",38,null,"SPP-500-LLPL",1,1,1,1,1,1,1,1,1,1,1,1,1,1,1,1,1,1,1,1,1,1,1,1,1,1,1,null,1,null,false,false,false,false,false,false,null,null,{"$f":"ROW()","v":173},null,null,null,null,null,null,null,null,null,null,null,null,null,null,null,null,null,null,null,null,null,null,null,null,null,null,null,null,null,null,null,null,null,null,null,null,null,null,null,null,null,null,null,null,null,null,null,null,null,null,null,null,null,null,null,38,"SPP-500-LLPL","In/Out door","In/Out door","In/Out door",null,null,173,0,0,173,173,null,"SPP-500-LLPL",0,0,0,0,0,0,0,0,0,0,1,1,"SPP-500-LLPL"]
["TFT-401",0.21376519999999999,5.8969999999999997E-4,"N/A",{"$f":"((B174*SQRT($E$3*1000)+C174*$E$3*1000))/30480*Length*(1+'Cable Parameters'!I174/100*('Cable Parameters'!$E$1-25))+('Insertion Loss'!$F$16+'Insertion Loss'!$F$17)*SQRT($E$3)","v":0},5.8,150,-55,0.2,"https://www.eimfirst.co.il/wp-content/uploads/2019/01/TFT.pdf",6.73,169,"TFT-401",null,174,174,174,174,174,174,"TFT-401",5.8,6.73,0,"N/A","In/Out door",19.05,null,"TFT-401",1,1,1,1,1,1,1,1,1,1,1,1,1,1,1,1,1,1,1,1,1,1,1,1,1,1,1,null,1,null,false,false,false,false,false,false,null,null,{"$f":"ROW()","v":174},null,null,null,null,null,null,null,null,null,null,null,null,null,null,null,null,null,null,null,null,null,null,null,null,null,null,null,null,null,null,null,null,null,null,null,null,null,null,null,null,null,null,null,null,null,null,null,null,null,null,null,null,null,null,null,19.05,"TFT-401","In/Out door","In/Out door","In/Out door",null,null,174,0,0,174,174,null,"TFT-401",0,0,0,0,0,0,0,0,0,0,1,1,"TFT-401"]
["TFT-402",0.3451224,1.752E-4,"N/A",{"$f":"((B175*SQRT($E$3*1000)+C175*$E$3*1000))/30480*Length*(1+'Cable Parameters'!I175/100*('Cable Parameters'!$E$1-25))+('Insertion Loss'!$F$16+'Insertion Loss'!$F$17)*SQRT($E$3)","v":0},5.8,150,-55,0.2,"https://www.eimfirst.co.il/wp-content/uploads/2019/01/TFT.pdf",4.0599999999999996,170,"TFT-402",null,175,175,175,175,175,175,"TFT-402",5.8,4.0599999999999996,0,"N/A","In/Out door",19.05,null,"TFT-402",1,1,1,1,1,1,1,1,1,1,1,1,1,1,1,1,1,1,1,1,1,1,1,1,1,1,1,null,1,null,false,false,false,false,false,false,null,null,{"$f":"ROW()","v":175},null,null,null,null,null,null,null,null,null,null,null,null,null,null,null,null,null,null,null,null,null,null,null,null,null,null,null,null,null,null,null,null,null,null,null,null,null,null,null,null,null,null,null,null,null,null,null,null,null,null,null,null,null,null,null,19.05,"TFT-402","In/Out door","In/Out door","In/Out door",null,null,175,0,0,175,175,null,"TFT-402",0,0,0,0,0,0,0,0,0,0,1,1,"TFT-402"]
["Silverline Standard",0.34799999999999998,1.1999999999999999E-3,"N/A",{"$f":"((B176*SQRT($E$3*1000)+C176*$E$3*1000))/30480*Length*(1+'Cable Parameters'!I176/100*('Cable Parameters'!$E$1-25))+('Insertion Loss'!$F$16+'Insertion Loss'!$F$17)*SQRT($E$3)","v":0},26.5,105,-55,0.2,"https://www.eimfirst.co.il/wp-content/uploads/2018/07/silverline-product-brochure-r.pdf",4.95,171,"Silverline Standard",null,176,176,176,176,176,176,"Silverline Standard",{"$f":"IF(T176=\"\",\"\",INDEX(A:N,T176,6))","v":26.5},{"$f":"IF(T176=\"\",\"\",INDEX(A:O,T176,11))","v":4.95},{"$f":"IF(T176=\"\",\"\",INDEX(A:P,T176,5))","v":0},{"$f":"IF(T176=\"\",\"\",INDEX(A:R,T176,4))","v":"N/A"},{"$f":"IF(ISERROR(IF($Q$2=\"\",INDEX(A:WQ,T176,128),IF($Q$2=1,INDEX(A:WQ,T176,126),INDEX(A:WQ,T176,127)))),\"\",IF($Q$2=\"\",INDEX(A:WQ,T176,128),IF($Q$2=1,INDEX(A:WQ,T176,126),INDEX(A:WQ,T176,127))))","v":"In/Out door"},{"$f":"IF(T176=\"\",\"\",INDEX(A:WQ,T176,124))","v":25},null,"Silverline Standard",1,1,1,1,1,1,1,1,1,1,1,1,1,1,1,1,1,1,1,1,1,1,1,1,1,1,1,null,1,null,{"$f":"OR(AND(AD176=0,AE176=0,AF176=0,AG176=0,AH176=0),BF176=0)","v":false},{"$f":"OR(AND(AI176=0,AJ176=0,AK176=0,AL176=0,AM176=0),BF176=0)","v":false},{"$f":"OR(AND(AN176=0,AO176=0,AP176=0,AQ176=0,AR176=0),BF176=0)","v":false},{"$f":"OR(AND(AS176=0,AT176=0,AU176=0,AV176=0,AW176=0),BF176=0)","v":false},{"$f":"OR(AND(AX176=0,AY176=0,AZ176=0,BA176=0,BB176=0),BF176=0)","v":false},{"$f":"OR(AND(BC176=0,BD176=0),BF176=0)","v":false},null,null,{"$f":"ROW()","v":176},null,null,null,null,null,null,null,null,null,null,null,null,null,null,null,null,null,null,null,null,null,null,null,null,null,null,null,null,null,null,null,null,null,null,null,null,null,null,null,null,null,null,null,null,null,null,null,null,null,null,null,null,null,null,null,25,"Silverline Standard","In/Out door","In/Out door","In/Out door",null,null,176,0,0,176,176,null,"Silverline Standard",0,0,0,0,0,0,0,0,1,0,0,0,"Silverline Standard"]
["Silverline SF (Super Flex)",0.340194,1.2421000000000001E-3,"N/A",{"$f":"((B177*SQRT($E$3*1000)+C177*$E$3*1000))/30480*Length*(1+'Cable Parameters'!I177/100*('Cable Parameters'!$E$1-25))+('Insertion Loss'!$F$16+'Insertion Loss'!$F$17)*SQRT($E$3)","v":0},18,85,-55,0.2,"https://www.eimfirst.co.il/wp-content/uploads/2018/07/silverline-product-brochure-r.pdf",4.95,172,"Silverline SF (Super Flex)",null,177,177,177,177,177,177,"Silverline SF (Super Flex)",18,4.95,0,"N/A","In/Out door",25,null,"Silverline SF (Super Flex)",1,1,1,1,1,1,1,1,1,1,1,1,1,1,1,1,1,1,1,1,1,1,1,1,1,1,1,null,1,null,false,false,false,false,false,false,null,null,{"$f":"ROW()","v":177},null,null,null,null,null,null,null,null,null,null,null,null,null,null,null,null,null,null,null,null,null,null,null,null,null,null,null,null,null,null,null,null,null,null,null,null,null,null,null,null,null,null,null,null,null,null,null,null,null,null,null,null,null,null,null,25,"Silverline SF (Super Flex)","In/Out door","In/Out door","In/Out door",null,null,177,0,0,177,177,null,"Silverline SF (Super Flex)",0,0,0,0,0,0,0,0,1,0,0,0,"Silverline SF (Super Flex)"]
["Silverline LL (Low Loss)",0.340194,1.2421000000000001E-3,"N/A",{"$f":"((B178*SQRT($E$3*1000)+C178*$E$3*1000))/30480*Length*(1+'Cable Parameters'!I178/100*('Cable Parameters'!$E$1-25))+('Insertion Loss'!$F$16+'Insertion Loss'!$F$17)*SQRT($E$3)","v":0},18,85,-55,0.2,"https://www.eimfirst.co.il/wp-content/uploads/2018/07/silverline-product-brochure-r.pdf",4.95,173,"Silverline LL (Low Loss)",null,178,{"$f":"IF(O178=\"\",\"\",IF($P$2=\"\",O178,IF(OR(INDEX(A:M,ROW(),6)=$P$2,INDEX(A:M,ROW(),6)>$P$2),ROW(),\"\")))","v":178},{"$f":"IF(P178=\"\",\"\",IF($Q$2=\"\",P178,IF(INDEX(DV:DW,ROW(),$Q$2)=\"\",\"\",ROW())))","v":178},{"$f":"IF(Q178=\"\",\"\",IF($R$2=\"\",Q178,IF(OR(INDEX(A:WQ,ROW(),4)=$R$2,INDEX(A:WQ,ROW(),4)>$R$2),ROW(),\"\")))","v":178},{"$f":"IF(R178=\"\",\"\",IF($S$2=\"\",R178,IF(OR(INDEX(A:N,ROW(),11)>$S$2+1,INDEX(A:N,ROW(),11)<$S$2-1),\"\",ROW())))","v":178},178,"Silverline LL (Low Loss)",18,4.95,0,"N/A","In/Out door",25,null,"Silverline LL (Low Loss)",1,1,1,1,1,1,1,1,1,1,1,1,1,1,1,1,1,1,1,1,1,1,1,1,1,1,1,null,1,null,false,false,false,false,false,false,null,null,{"$f":"ROW()","v":178},null,null,null,null,null,null,null,null,null,null,null,null,null,null,null,null,null,null,null,null,null,null,null,null,null,null,null,null,null,null,null,null,null,null,null,null,null,null,null,null,null,null,null,null,null,null,null,null,null,null,null,null,null,null,null,25,"Silverline LL (Low Loss)","In/Out door","In/Out door","In/Out door",null,null,178,0,0,178,178,null,"Silverline LL (Low Loss)",0,0,0,0,0,0,0,0,1,0,0,0,"Silverline LL (Low Loss)"]
["Silverline TT (TempTrack)",0.33789540000000001,1.3148000000000001E-3,"N/A",{"$f":"((B179*SQRT($E$3*1000)+C179*$E$3*1000))/30480*Length*(1+'Cable Parameters'!I179/100*('Cable Parameters'!$E$1-25))+('Insertion Loss'!$F$16+'Insertion Loss'!$F$17)*SQRT($E$3)","v":0},18,125,-55,0.2,"https://www.eimfirst.co.il/wp-content/uploads/2018/07/silverline-product-brochure-r.pdf",4.95,174,"Silverline TT (TempTrack)",null,179,179,179,179,179,179,"Silverline TT (TempTrack)",18,4.95,0,"N/A","In/Out door",25,null,"Silverline TT (TempTrack)",1,1,1,1,1,1,1,1,1,1,1,1,1,1,1,1,1,1,1,1,1,1,1,1,1,1,1,null,1,null,false,false,false,false,false,false,null,null,{"$f":"ROW()","v":179},null,null,null,null,null,null,null,null,null,null,null,null,null,null,null,null,null,null,null,null,null,null,null,null,null,null,null,null,null,null,null,null,null,null,null,null,null,null,null,null,null,null,null,null,null,null,null,null,null,null,null,null,null,null,null,25,"Silverline TT (TempTrack)","In/Out door","In/Out door","In/Out door",null,null,179,0,0,179,179,null,"Silverline TT (TempTrack)",0,0,0,0,0,0,0,0,1,0,0,0,"Silverline TT (TempTrack)"]
["Silverline TT (Extra Flex)",0.49656,7.9889999999999996E-4,"N/A",{"$f":"((B180*SQRT($E$3*1000)+C180*$E$3*1000))/30480*Length*(1+'Cable Parameters'!I180/100*('Cable Parameters'!$E$1-25))+('Insertion Loss'!$F$16+'Insertion Loss'!$F$17)*SQRT($E$3)","v":0},18,85,-55,0.2,"https://www.eimfirst.co.il/wp-content/uploads/2018/07/silverline-product-brochure-r.pdf",3.8,175,"Silverline TT (Extra Flex)",null,180,180,180,180,180,180,"Silverline TT (Extra Flex)",18,3.8,0,"N/A","In/Out door",19,null,"Silverline TT (Extra Flex)",1,1,1,1,1,1,1,1,1,1,1,1,1,1,1,1,1,1,1,1,1,1,1,1,1,1,1,null,1,null,false,false,false,false,false,false,null,null,{"$f":"ROW()","v":180},null,null,null,null,null,null,null,null,null,null,null,null,null,null,null,null,null,null,null,null,null,null,null,null,null,null,null,null,null,null,null,null,null,null,null,null,null,null,null,null,null,null,null,null,null,null,null,null,null,null,null,null,null,null,null,19,"Silverline TT (Extra Flex)","In/Out door","In/Out door","In/Out door",null,null,180,0,0,180,180,null,"Silverline TT (Extra Flex)",0,0,0,0,0,0,0,0,1,0,0,0,"Silverline TT (Extra Flex)"]
["Silverline 75 (75 Ohm)",0.3489024,1.1965999999999999E-3,"N/A",{"$f":"((B181*SQRT($E$3*1000)+C181*$E$3*1000))/30480*Length*(1+'Cable Parameters'!I181/100*('Cable Parameters'!$E$1-25))+('Insertion Loss'!$F$16+'Insertion Loss'!$F$17)*SQRT($E$3)","v":0},3,125,-55,0.2,"https://www.eimfirst.co.il/wp-content/uploads/2018/07/silverline-product-brochure-r.pdf",4.95,176,"Silverline 75 (75 Ohm)",null,181,181,181,181,181,181,"Silverline 75 (75 Ohm)",3,4.95,0,"N/A","In/Out door",25,null,"Silverline 75 (75 Ohm)",1,1,1,1,1,1,1,1,1,1,1,1,1,1,1,1,1,1,1,1,1,1,1,1,1,1,1,null,1,null,false,false,false,false,false,false,null,null,{"$f":"ROW()","v":181},null,null,null,null,null,null,null,null,null,null,null,null,null,null,null,null,null,null,null,null,null,null,null,null,null,null,null,null,null,null,null,null,null,null,null,null,null,null,null,null,null,null,null,null,null,null,null,null,null,null,null,null,null,null,null,25,"Silverline 75 (75 Ohm)","In/Out door","In/Out door","In/Out door",null,null,181,0,0,181,181,null,"Silverline 75 (75 Ohm)",0,0,0,0,0,0,0,0,1,0,0,0,"Silverline 75 (75 Ohm)"]
["Silverline VNA",0.33617829999999999,3.6910000000000003E-4,"N/A",{"$f":"((B182*SQRT($E$3*1000)+C182*$E$3*1000))/30480*Length*(1+'Cable Parameters'!I182/100*('Cable Parameters'!$E$1-25))+('Insertion Loss'!$F$16+'Insertion Loss'!$F$17)*SQRT($E$3)","v":0},40,25,25,0.2,"https://www.eimfirst.co.il/wp-content/uploads/2018/07/silverline-product-brochure-r.pdf",10.8,177,"Silverline VNA",null,182,182,182,182,182,182,"Silverline VNA",40,10.8,0,"N/A","Indoor Only",63.5,null,"Silverline VNA",1,1,1,1,1,1,1,1,1,1,1,1,1,1,1,1,1,1,1,1,1,1,1,1,1,1,1,null,1,null,false,false,false,false,false,false,null,null,{"$f":"ROW()","v":182},null,null,null,null,null,null,null,null,null,null,null,null,null,null,null,null,null,null,null,null,null,null,null,null,null,null,null,null,null,null,null,null,null,null,null,null,null,null,null,null,null,null,null,null,null,null,null,null,null,null,null,null,null,null,null,63.5,"Silverline VNA","Indoor Only",null,"Indoor Only",null,null,182,0,0,182,182,null,"Silverline VNA",0,0,0,0,0,0,0,0,1,0,0,0,"Silverline VNA"]
["Clarity™ Series",0.31926399999999999,4.5370000000000002E-4,"N/A",{"$f":"((B183*SQRT($E$3*1000)+C183*$E$3*1000))/30480*Length*(1+'Cable Parameters'!I183/100*('Cable Parameters'!$E$1-25))+('Insertion Loss'!$F$16+'Insertion Loss'!$F$17)*SQRT($E$3)","v":0},40,25,25,0.2,"https://www.eimfirst.co.il/wp-content/uploads/2019/01/Clarity-Series-test-cables-R.pdf",5.5,178,"Clarity™ Series",null,183,183,183,183,183,183,"Clarity™ Series",40,5.5,0,"N/A","Indoor Only",50,null,"Clarity™ Series",1,1,1,1,1,1,1,1,1,1,1,1,1,1,1,1,1,1,1,1,1,1,1,1,1,1,1,null,1,null,false,false,false,false,false,false,null,null,{"$f":"ROW()","v":183},null,null,null,null,null,null,null,null,null,null,null,null,null,null,null,null,null,null,null,null,null,null,null,null,null,null,null,null,null,null,null,null,null,null,null,null,null,null,null,null,null,null,null,null,null,null,null,null,null,null,null,null,null,null,null,50,"Clarity™ Series","Indoor Only",null,"Indoor Only",null,null,183,{"$f":"IF($EA183=\"\",\"\",IF(ISERROR(INDEX(A:EE,EA183,5)),EA183,INDEX(A:EE,EA183,5)))","v":0},0,{"$f":"EA183","v":183},{"$f":"IF($P$2=\"\",EA183,VLOOKUP(EC183,$EB:$EE,3,FALSE))","v":183},null,"Clarity™ Series",0,0,0,0,0,0,0,0,1,0,0,0,"Clarity™ Series"]
["LMR100A",0.70913999999999999,1.74E-3,"N/A",{"$f":"((B184*SQRT($E$3*1000)+C184*$E$3*1000))/30480*Length*(1+'Cable Parameters'!I184/100*('Cable Parameters'!$E$1-25))+('Insertion Loss'!$F$16+'Insertion Loss'!$F$17)*SQRT($E$3)","v":0},8,85,-40,0.2,"https://www.eimfirst.co.il/wp-content/uploads/2019/02/LMR-100A.pdf",2.79,179,"LMR100A",null,184,184,184,184,184,184,"LMR100A",8,2.79,0,"N/A","In/Out door",6.4,null,"LMR100A",1,1,1,1,1,1,1,1,1,1,1,1,1,1,1,1,1,1,1,1,1,1,1,1,1,1,1,null,1,null,false,false,false,false,false,false,null,null,{"$f":"ROW()","v":184},null,null,null,null,null,null,null,null,null,null,null,null,null,null,null,null,null,null,null,null,null,null,null,null,null,null,null,null,null,null,null,null,null,null,null,null,null,null,null,null,null,null,null,null,null,null,null,null,null,null,null,null,null,null,null,6.4,"LMR100A","In/Out door","In/Out door","In/Out door",null,null,184,{"$f":"IF($EA184=\"\",\"\",IF(ISERROR(INDEX(A:EE,EA184,5)),EA184,INDEX(A:EE,EA184,5)))","v":0},0,{"$f":"EA184","v":184},{"$f":"IF($P$2=\"\",EA184,VLOOKUP(EC184,$EB:$EE,3,FALSE))","v":184},null,"LMR100A",0,0,0,0,1,1,1,0,0,0,1,1,"LMR100A"]
["LMR195",0.35685899999999998,4.6999999999999999E-4,"N/A",{"$f":"((B185*SQRT($E$3*1000)+C185*$E$3*1000))/30480*Length*(1+'Cable Parameters'!I185/100*('Cable Parameters'!$E$1-25))+('Insertion Loss'!$F$16+'Insertion Loss'!$F$17)*SQRT($E$3)","v":0},8,85,-40,0.2,"https://www.eimfirst.co.il/wp-content/uploads/2019/02/LMR-195.pdf",4.95,180,"LMR195",null,185,185,185,{"$f":"IF(Q185=\"\",\"\",IF($R$2=\"\",Q185,IF(OR(INDEX(A:WQ,ROW(),4)=$R$2,INDEX(A:WQ,ROW(),4)>$R$2),ROW(),\"\")))","v":185},{"$f":"IF(R185=\"\",\"\",IF($S$2=\"\",R185,IF(OR(INDEX(A:N,ROW(),11)>$S$2+1,INDEX(A:N,ROW(),11)<$S$2-1),\"\",ROW())))","v":185},{"$f":"EE185","v":185},{"$f":"IF(T185=\"\",\"\",INDEX(A:M,T185,1))","v":"LMR195"},{"$f":"IF(T185=\"\",\"\",INDEX(A:N,T185,6))","v":8},{"$f":"IF(T185=\"\",\"\",INDEX(A:O,T185,11))","v":4.95},{"$f":"IF(T185=\"\",\"\",INDEX(A:P,T185,5))","v":0},{"$f":"IF(T185=\"\",\"\",INDEX(A:R,T185,4))","v":"N/A"},{"$f":"IF(ISERROR(IF($Q$2=\"\",INDEX(A:WQ,T185,128),IF($Q$2=1,INDEX(A:WQ,T185,126),INDEX(A:WQ,T185,127)))),\"\",IF($Q$2=\"\",INDEX(A:WQ,T185,128),IF($Q$2=1,INDEX(A:WQ,T185,126),INDEX(A:WQ,T185,127))))","v":"In/Out door"},{"$f":"IF(T185=\"\",\"\",INDEX(A:WQ,T185,124))","v":12.7},null,"LMR195",1,1,1,1,1,1,1,1,1,1,1,1,1,1,1,1,1,1,1,1,1,1,1,1,1,1,1,null,1,null,false,false,false,false,false,false,null,null,{"$f":"ROW()","v":185},null,null,null,null,null,null,null,null,null,null,null,null,null,null,null,null,null,null,null,null,null,null,null,null,null,null,null,null,null,null,null,null,null,null,null,null,null,null,null,null,null,null,null,null,null,null,null,null,null,null,null,null,null,null,null,12.7,"LMR195","In/Out door","In/Out door","In/Out door",null,null,185,0,0,185,185,null,"LMR195",0,0,0,0,1,1,1,0,0,0,1,1,"LMR195"]
["LMR 200",0.32090000000000002,3.3E-4,"N/A",{"$f":"((B186*SQRT($E$3*1000)+C186*$E$3*1000))/30480*Length*(1+'Cable Parameters'!I186/100*('Cable Parameters'!$E$1-25))+('Insertion Loss'!$F$16+'Insertion Loss'!$F$17)*SQRT($E$3)","v":0},8,85,-40,0.2,"https://www.eimfirst.co.il/wp-content/uploads/2019/02/LMR-200.pdf",4.95,181,"LMR 200",null,186,186,186,186,186,186,"LMR 200",8,4.95,0,"N/A","In/Out door",12.7,null,"LMR 200",1,1,1,1,1,1,1,1,1,1,1,1,1,1,1,1,1,1,1,1,1,1,1,1,1,1,1,null,1,null,false,false,false,false,false,false,null,null,{"$f":"ROW()","v":186},null,null,null,null,null,null,null,null,null,null,null,null,null,null,null,null,null,null,null,null,null,null,null,null,null,null,null,null,null,null,null,null,null,null,null,null,null,null,null,null,null,null,null,null,null,null,null,null,null,null,null,null,null,null,null,12.7,"LMR 200","In/Out door","In/Out door","In/Out door",null,null,186,0,0,186,186,null,"LMR 200",0,0,0,0,1,1,1,0,0,0,1,1,"LMR 200"]
["LMR 240",0.24207999999999999,3.3E-4,"N/A",{"$f":"((B187*SQRT($E$3*1000)+C187*$E$3*1000))/30480*Length*(1+'Cable Parameters'!I187/100*('Cable Parameters'!$E$1-25))+('Insertion Loss'!$F$16+'Insertion Loss'!$F$17)*SQRT($E$3)","v":0},8,85,-40,0.2,"https://www.eimfirst.co.il/wp-content/uploads/2019/02/LMR-240.pdf",6.1,182,"LMR 240",null,187,187,187,187,187,187,"LMR 240",8,6.1,0,"N/A","In/Out door",19.100000000000001,null,"LMR 240",1,1,1,1,1,1,1,1,1,1,1,1,1,1,1,1,1,1,1,1,1,1,1,1,1,1,1,null,1,null,false,false,false,false,false,false,null,null,{"$f":"ROW()","v":187},null,null,null,null,null,null,null,null,null,null,null,null,null,null,null,null,null,null,null,null,null,null,null,null,null,null,null,null,null,null,null,null,null,null,null,null,null,null,null,null,null,null,null,null,null,null,null,null,null,null,null,null,null,null,null,19.100000000000001,"LMR 240","In/Out door","In/Out door","In/Out door",null,null,187,0,0,187,187,null,"LMR 240",0,0,0,0,1,1,1,0,0,0,1,1,"LMR 240"]
["LMR 300",0.19192999999999999,3.3E-4,"N/A",{"$f":"((B188*SQRT($E$3*1000)+C188*$E$3*1000))/30480*Length*(1+'Cable Parameters'!I188/100*('Cable Parameters'!$E$1-25))+('Insertion Loss'!$F$16+'Insertion Loss'!$F$17)*SQRT($E$3)","v":0},8,85,-40,0.2,"https://www.eimfirst.co.il/wp-content/uploads/2019/02/LMR-300.pdf",7.62,183,"LMR 300",null,188,188,188,188,188,188,"LMR 300",8,7.62,0,"N/A","In/Out door",22.2,null,"LMR 300",1,1,1,1,1,1,1,1,1,1,1,1,1,1,1,1,1,1,1,1,1,1,1,1,1,1,1,null,1,null,false,false,false,false,false,false,null,null,{"$f":"ROW()","v":188},null,null,null,null,null,null,null,null,null,null,null,null,null,null,null,null,null,null,null,null,null,null,null,null,null,null,null,null,null,null,null,null,null,null,null,null,null,null,null,null,null,null,null,null,null,null,null,null,null,null,null,null,null,null,null,22.2,"LMR 300","In/Out door","In/Out door","In/Out door",null,null,188,0,0,188,188,null,"LMR 300",0,0,0,0,1,1,1,0,0,0,1,1,"LMR 300"]
["M17/113-RG316",0.78700000000000003,1.1999999999999999E-3,"N/A",{"$f":"((B189*SQRT($E$3*1000)+C189*$E$3*1000))/30480*Length*(1+'Cable Parameters'!I189/100*('Cable Parameters'!$E$1-25))+('Insertion Loss'!$F$16+'Insertion Loss'!$F$17)*SQRT($E$3)","v":0},3,200,-55,0.2,"https://www.eimfirst.co.il/wp-content/uploads/2019/02/MIL-C-17-RG-CABLES.pdf",2.4900000000000002,184,"M17/113-RG316",null,189,189,189,189,189,189,"M17/113-RG316",3,2.4900000000000002,0,"N/A","Indoor Only",12.45,null,"M17/113-RG316",1,1,1,1,1,1,1,1,1,1,1,1,1,1,1,1,1,1,1,1,1,1,1,1,1,1,1,null,1,null,false,false,false,false,false,false,null,null,{"$f":"ROW()","v":189},null,null,null,null,null,null,null,null,null,null,null,null,null,null,null,null,null,null,null,null,null,null,null,null,null,null,null,null,null,null,null,null,null,null,null,null,null,null,null,null,null,null,null,null,null,null,null,null,null,null,null,null,null,null,null,12.45,"M17/113-RG316","Indoor Only",null,"Indoor Only",null,null,189,0,0,189,189,null,"M17/113-RG316",1,0,1,0,1,0,0,0,0,1,1,1,"M17/113-RG316"]
["M17/119-RG174",0.82599999999999996,1.2600000000000001E-3,"N/A",{"$f":"((B190*SQRT($E$3*1000)+C190*$E$3*1000))/30480*Length*(1+'Cable Parameters'!I190/100*('Cable Parameters'!$E$1-25))+('Insertion Loss'!$F$16+'Insertion Loss'!$F$17)*SQRT($E$3)","v":0},1,85,-40,0.2,"https://www.eimfirst.co.il/wp-content/uploads/2019/02/MIL-C-17-RG-CABLES.pdf",2.79,185,"M17/119-RG174",null,190,190,190,190,190,190,"M17/119-RG174",1,2.79,0,"N/A","Indoor Only",13.95,null,"M17/119-RG174",1,1,1,1,1,1,1,1,1,1,1,1,1,1,1,1,1,1,1,1,1,1,1,1,1,1,1,null,1,null,false,false,false,false,false,false,null,null,{"$f":"ROW()","v":190},null,null,null,null,null,null,null,null,null,null,null,null,null,null,null,null,null,null,null,null,null,null,null,null,null,null,null,null,null,null,null,null,null,null,null,null,null,null,null,null,null,null,null,null,null,null,null,null,null,null,null,null,null,null,null,13.95,"M17/119-RG174","Indoor Only",null,"Indoor Only",null,null,190,0,0,190,190,null,"M17/119-RG174",1,0,1,0,1,0,0,0,0,1,1,1,"M17/119-RG174"]
["M17/84-RG223",0.38400000000000001,1.2600000000000001E-3,"N/A",{"$f":"((B191*SQRT($E$3*1000)+C191*$E$3*1000))/30480*Length*(1+'Cable Parameters'!I191/100*('Cable Parameters'!$E$1-25))+('Insertion Loss'!$F$16+'Insertion Loss'!$F$17)*SQRT($E$3)","v":0},12.4,85,-40,0.2,"https://www.eimfirst.co.il/wp-content/uploads/2019/02/MIL-C-17-RG-CABLES.pdf",5.38,186,"M17/84-RG223",null,191,191,191,191,191,191,"M17/84-RG223",12.4,5.38,0,"N/A","Indoor Only",26.9,null,"M17/84-RG223",1,1,1,1,1,1,1,1,1,1,1,1,1,1,1,1,1,1,1,1,1,1,1,1,1,1,1,null,1,null,false,false,false,false,false,false,null,null,{"$f":"ROW()","v":191},null,null,null,null,null,null,null,null,null,null,null,null,null,null,null,null,null,null,null,null,null,null,null,null,null,null,null,null,null,null,null,null,null,null,null,null,null,null,null,null,null,null,null,null,null,null,null,null,null,null,null,null,null,null,null,26.9,"M17/84-RG223","Indoor Only",null,"Indoor Only",null,null,191,0,0,191,191,null,"M17/84-RG223",1,0,1,0,1,0,0,0,0,1,1,1,"M17/84-RG223"]
[null,null,null,"N/A",{"$f":"((B192*SQRT($E$3*1000)+C192*$E$3*1000))/30480*Length*(1+'Cable Parameters'!I192/100*('Cable Parameters'!$E$1-25))+('Insertion Loss'!$F$16+'Insertion Loss'!$F$17)*SQRT($E$3)","v":0},null,null,null,null,null,null,187,0,null,192,192,192,192,192,192,0,0,0,0,"N/A","?",0,null,{"$f":"A159","v":"M17/28-RG 58"},1,1,1,1,1,1,1,1,1,1,1,1,1,1,1,1,1,1,1,1,1,1,1,1,1,1,1,null,1,null,false,false,false,false,false,false,null,null,{"$f":"ROW()","v":192},null,null,null,null,null,null,null,null,null,null,null,null,null,null,null,null,null,null,null,null,null,null,null,null,null,null,null,null,null,null,null,null,null,null,null,null,null,null,null,null,null,null,null,null,null,null,null,null,null,null,null,null,null,null,null,null,0,"?","?","?",null,null,192,0,0,192,192,null,0,null,null,null,null,null,null,null,null,null,null,null,null,0]
[null,null,null,"N/A",{"$f":"((B193*SQRT($E$3*1000)+C193*$E$3*1000))/30480*Length*(1+'Cable Parameters'!I193/100*('Cable Parameters'!$E$1-25))+('Insertion Loss'!$F$16+'Insertion Loss'!$F$17)*SQRT($E$3)","v":0},null,null,null,null,null,null,188,0,null,193,193,193,193,193,193,0,0,0,0,"N/A","?","?",null,0,1,1,1,1,1,1,1,1,1,1,1,1,1,1,1,1,1,1,1,1,1,1,1,1,1,1,1,null,1,null,false,false,false,false,false,false,null,null,{"$f":"ROW()","v":193},null,null,null,null,null,null,null,null,null,null,null,null,null,null,null,null,null,null,null,null,null,null,null,null,null,null,null,null,null,null,null,null,null,null,null,null,null,null,null,null,null,null,null,null,null,null,null,null,null,null,null,null,null,null,null,"?",0,"?","?","?",null,null,193,0,0,193,193,null,0,null,null,null,null,null,null,null,null,null,null,null,null,0]
[null,null,null,"N/A",{"$f":"((B194*SQRT($E$3*1000)+C194*$E$3*1000))/30480*Length*(1+'Cable Parameters'!I194/100*('Cable Parameters'!$E$1-25))+('Insertion Loss'!$F$16+'Insertion Loss'!$F$17)*SQRT($E$3)","v":0},null,null,null,null,null,null,189,0,null,194,194,194,194,194,194,0,0,0,0,"N/A","?","?",null,0,1,1,1,1,1,1,1,1,1,1,1,1,1,1,1,1,1,1,1,1,1,1,1,1,1,1,1,null,1,null,false,false,false,false,false,false,null,null,{"$f":"ROW()","v":194},null,null,null,null,null,null,null,null,null,null,null,null,null,null,null,null,null,null,null,null,null,null,null,null,null,null,null,null,null,null,null,null,null,null,null,null,null,null,null,null,null,null,null,null,null,null,null,null,null,null,null,null,null,null,null,"?",0,"?","?","?",null,null,194,0,0,194,194,null,0,null,null,null,null,null,null,null,null,null,null,null,null,0]
[null,null,null,"N/A",{"$f":"((B195*SQRT($E$3*1000)+C195*$E$3*1000))/30480*Length*(1+'Cable Parameters'!I195/100*('Cable Parameters'!$E$1-25))+('Insertion Loss'!$F$16+'Insertion Loss'!$F$17)*SQRT($E$3)","v":0},null,null,null,null,null,null,190,0,null,195,195,195,195,195,195,0,0,0,0,"N/A","?","?",null,0,1,1,1,1,1,1,1,1,1,1,1,1,1,1,1,1,1,1,1,1,1,1,1,1,1,1,1,null,1,null,false,false,false,false,false,false,null,null,{"$f":"ROW()","v":195},null,null,null,null,null,null,null,null,null,null,null,null,null,null,null,null,null,null,null,null,null,null,null,null,null,null,null,null,null,null,null,null,null,null,null,null,null,null,null,null,null,null,null,null,null,null,null,null,null,null,null,null,null,null,null,"?",0,"?","?","?",null,null,195,0,0,195,195,null,0,null,null,null,null,null,null,null,null,null,null,null,null,0]
[null,null,null,"N/A",{"$f":"((B196*SQRT($E$3*1000)+C196*$E$3*1000))/30480*Length*(1+'Cable Parameters'!I196/100*('Cable Parameters'!$E$1-25))+('Insertion Loss'!$F$16+'Insertion Loss'!$F$17)*SQRT($E$3)","v":0},null,null,null,null,null,null,191,0,null,196,{"$f":"IF(O196=\"\",\"\",IF($P$2=\"\",O196,IF(OR(INDEX(A:M,ROW(),6)=$P$2,INDEX(A:M,ROW(),6)>$P$2),ROW(),\"\")))","v":196},{"$f":"IF(P196=\"\",\"\",IF($Q$2=\"\",P196,IF(INDEX(DV:DW,ROW(),$Q$2)=\"\",\"\",ROW())))","v":196},196,196,196,0,0,0,0,"N/A","?","?",null,0,1,1,1,1,1,1,1,1,1,1,1,1,1,1,1,1,1,1,1,1,1,1,1,1,1,1,1,null,2,null,{"$f":"OR(AND(AD196=0,AE196=0,AF196=0,AG196=0,AH196=0),BF196=0)","v":false},{"$f":"OR(AND(AI196=0,AJ196=0,AK196=0,AL196=0,AM196=0),BF196=0)","v":false},{"$f":"OR(AND(AN196=0,AO196=0,AP196=0,AQ196=0,AR196=0),BF196=0)","v":false},{"$f":"OR(AND(AS196=0,AT196=0,AU196=0,AV196=0,AW196=0),BF196=0)","v":false},{"$f":"OR(AND(AX196=0,AY196=0,AZ196=0,BA196=0,BB196=0),BF196=0)","v":false},{"$f":"OR(AND(BC196=0,BD196=0),BF196=0)","v":false},null,null,{"$f":"ROW()","v":196},null,null,null,null,null,null,null,null,null,null,null,null,null,null,null,null,null,null,null,null,null,null,null,null,null,null,null,null,null,null,null,null,null,null,null,null,null,null,null,null,null,null,null,null,null,null,null,null,null,null,null,null,null,null,null,"?",0,"?","?","?",null,null,196,0,0,196,196,null,0,null,null,null,null,null,null,null,null,null,null,null,null,0]
[null,null,null,"N/A",{"$f":"((B197*SQRT($E$3*1000)+C197*$E$3*1000))/30480*Length*(1+'Cable Parameters'!I197/100*('Cable Parameters'!$E$1-25))+('Insertion Loss'!$F$16+'Insertion Loss'!$F$17)*SQRT($E$3)","v":0},null,null,null,null,null,null,192,0,null,197,197,197,197,197,197,0,0,0,0,"N/A","?","?",null,0,1,1,1,1,1,1,1,1,1,1,1,1,1,1,1,1,1,1,1,1,1,1,1,1,1,1,1,null,3,null,false,false,false,false,false,false,null,null,{"$f":"ROW()","v":197},null,null,null,null,null,null,null,null,null,null,null,null,null,null,null,null,null,null,null,null,null,null,null,null,null,null,null,null,null,null,null,null,null,null,null,null,null,null,null,null,null,null,null,null,null,null,null,null,null,null,null,null,null,null,null,"?",0,"?","?","?",null,null,197,0,0,197,197,null,0,null,null,null,null,null,null,null,null,null,null,null,null,0]
[null,null,null,"N/A",{"$f":"((B198*SQRT($E$3*1000)+C198*$E$3*1000))/30480*Length*(1+'Cable Parameters'!I198/100*('Cable Parameters'!$E$1-25))+('Insertion Loss'!$F$16+'Insertion Loss'!$F$17)*SQRT($E$3)","v":0},null,null,null,null,null,null,193,0,null,198,198,198,198,198,198,0,0,0,0,"N/A","?","?",null,0,1,1,1,1,1,1,1,1,1,1,1,1,1,1,1,1,1,1,1,1,1,1,1,1,1,1,1,null,4,null,false,false,false,false,false,false,null,null,{"$f":"ROW()","v":198},null,null,null,null,null,null,null,null,null,null,null,null,null,null,null,null,null,null,null,null,null,null,null,null,null,null,null,null,null,null,null,null,null,null,null,null,null,null,null,null,null,null,null,null,null,null,null,null,null,null,null,null,null,null,null,"?",0,"?","?","?",null,null,198,0,0,198,198,null,0,null,null,null,null,null,null,null,null,null,null,null,null,0]
[null,null,null,"N/A",{"$f":"((B199*SQRT($E$3*1000)+C199*$E$3*1000))/30480*Length*(1+'Cable Parameters'!I199/100*('Cable Parameters'!$E$1-25))+('Insertion Loss'!$F$16+'Insertion Loss'!$F$17)*SQRT($E$3)","v":0},null,null,null,null,null,null,194,{"$f":"ET199","v":0},null,{"$f":"IF(M199=\"\",\"\",     IF($M$4=0,ROW(), IF(ISERROR(FIND($N$4,UPPER(A199))),\"\",ROW())))","v":199},199,199,199,199,199,0,0,0,0,"N/A","?","?",null,{"$f":"A199","v":0},1,1,1,1,1,1,1,1,1,1,1,1,1,1,1,1,1,1,1,1,1,1,1,1,1,1,1,null,5,null,false,false,false,false,false,false,null,null,{"$f":"ROW()","v":199},null,null,null,null,null,null,null,null,null,null,null,null,null,null,null,null,null,null,null,null,null,null,null,null,null,null,null,null,null,null,null,null,null,null,null,null,null,null,null,null,null,null,null,null,null,null,null,null,null,null,null,null,null,null,null,"?",0,"?","?","?",null,null,{"$f":"IF(ISERROR(SMALL($S$6:$S$250,$L199)),\"\",SMALL($S$6:$S$250,$L199))","v":199},0,{"$f":"IF(ISERROR(SMALL($EB$6:$EB$250,$L199)),\"\",SMALL($EB$6:$EB$250,$L199))","v":0},199,199,null,{"$f":"A199","v":0},null,null,null,null,null,null,null,null,null,null,null,null,{"$f":"IF($ET$3=\"\",INDEX($A:$ES,ROW(),137),IF(INDEX($A:$ES,ROW(),$ET$3)=1,INDEX($A:$ES,ROW(),137),\"\"))","v":0}]
[null,null,null,"N/A",{"$f":"((B200*SQRT($E$3*1000)+C200*$E$3*1000))/30480*Length*(1+'Cable Parameters'!I200/100*('Cable Parameters'!$E$1-25))+('Insertion Loss'!$F$16+'Insertion Loss'!$F$17)*SQRT($E$3)","v":0},null,null,null,null,null,null,195,0,{"$f":"UPPER(LEFT(M200,$M$4))","v":""},200,200,200,200,200,200,0,0,0,0,"N/A","?","?",null,0,1,1,1,1,1,1,1,1,1,1,1,1,1,1,1,1,1,1,1,1,1,1,1,1,1,1,1,null,6,null,false,false,false,false,false,false,null,null,{"$f":"ROW()","v":200},null,null,null,null,null,null,null,null,null,null,null,null,null,null,null,null,null,null,null,null,null,null,null,null,null,null,null,null,null,null,null,null,null,null,null,null,null,null,null,null,null,null,null,null,null,null,null,null,null,null,null,null,null,null,null,"?",{"$f":"A200","v":0},"?","?","?",null,null,200,0,0,200,200,null,0,null,null,null,null,null,null,null,null,null,null,null,null,0]
[null,null,null,"N/A",{"$f":"((B201*SQRT($E$3*1000)+C201*$E$3*1000))/30480*Length*(1+'Cable Parameters'!I201/100*('Cable Parameters'!$E$1-25))+('Insertion Loss'!$F$16+'Insertion Loss'!$F$17)*SQRT($E$3)","v":0},null,null,null,null,null,null,196,0,"",201,201,201,201,201,201,0,0,0,0,"N/A","?","?",null,0,1,1,1,1,1,1,1,1,1,1,1,1,1,1,1,1,1,1,1,1,1,1,1,1,1,1,1,null,7,null,false,false,false,false,false,false,null,null,{"$f":"ROW()","v":201},null,null,null,null,null,null,null,null,null,null,null,null,null,null,null,null,null,null,null,null,null,null,null,null,null,null,null,null,null,null,null,null,null,null,null,null,null,null,null,null,null,null,null,null,null,null,null,null,null,null,null,null,null,null,null,"?",0,"?","?","?",null,null,201,0,0,201,201,null,0,null,null,null,null,null,null,null,null,null,null,null,null,0]
[null,null,null,"N/A",{"$f":"((B202*SQRT($E$3*1000)+C202*$E$3*1000))/30480*Length*(1+'Cable Parameters'!I202/100*('Cable Parameters'!$E$1-25))+('Insertion Loss'!$F$16+'Insertion Loss'!$F$17)*SQRT($E$3)","v":0},null,null,null,null,null,null,197,0,"",202,202,202,202,202,202,0,0,0,0,"N/A","?","?",null,0,1,1,1,1,1,1,1,1,1,1,1,1,1,1,1,1,1,1,1,1,1,1,1,1,1,1,1,null,8,null,false,false,false,false,false,false,null,null,{"$f":"ROW()","v":202},null,null,null,null,null,null,null,null,null,null,null,null,null,null,null,null,null,null,null,null,null,null,null,null,null,null,null,null,null,null,null,null,null,null,null,null,null,null,null,null,null,null,null,null,null,null,null,null,null,null,null,null,null,null,null,"?",0,"?","?","?",null,null,202,0,0,202,202,null,0,null,null,null,null,null,null,null,null,null,null,null,null,0]
[null,null,null,"N/A",{"$f":"((B203*SQRT($E$3*1000)+C203*$E$3*1000))/30480*Length*(1+'Cable Parameters'!I203/100*('Cable Parameters'!$E$1-25))+('Insertion Loss'!$F$16+'Insertion Loss'!$F$17)*SQRT($E$3)","v":0},null,null,null,null,null,null,198,0,"",203,203,203,203,203,203,0,0,0,0,"N/A","?","?",null,0,1,1,1,1,1,1,1,1,1,1,1,1,1,1,1,1,1,1,1,1,1,1,1,1,1,1,1,null,9,null,false,false,false,false,false,false,null,null,{"$f":"ROW()","v":203},null,null,null,null,null,null,null,null,null,null,null,null,null,null,null,null,null,null,null,null,null,null,null,null,null,null,null,null,null,null,null,null,null,null,null,null,null,null,null,null,null,null,null,null,null,null,null,null,null,null,null,null,null,null,null,"?",0,"?","?","?",null,null,203,0,0,203,203,null,0,null,null,null,null,null,null,null,null,null,null,null,null,0]
[null,null,null,"N/A",{"$f":"((B204*SQRT($E$3*1000)+C204*$E$3*1000))/30480*Length*(1+'Cable Parameters'!I204/100*('Cable Parameters'!$E$1-25))+('Insertion Loss'!$F$16+'Insertion Loss'!$F$17)*SQRT($E$3)","v":0},null,null,null,null,null,null,199,0,"",204,204,204,204,204,204,0,0,0,0,"N/A","?","?",null,0,1,1,1,1,1,1,1,1,1,1,1,1,1,1,1,1,1,1,1,1,1,1,1,1,1,1,1,null,10,null,false,false,false,false,false,false,null,null,{"$f":"ROW()","v":204},null,null,null,null,null,null,null,null,null,null,null,null,null,null,null,null,null,null,null,null,null,null,null,null,null,null,null,null,null,null,null,null,null,null,null,null,null,null,null,null,null,null,null,null,null,null,null,null,null,null,null,null,null,null,null,"?",0,"?","?","?",null,null,204,0,0,204,204,null,0,null,null,null,null,null,null,null,null,null,null,null,null,0]
[null,null,null,"N/A",{"$f":"((B205*SQRT($E$3*1000)+C205*$E$3*1000))/30480*Length*(1+'Cable Parameters'!I205/100*('Cable Parameters'!$E$1-25))+('Insertion Loss'!$F$16+'Insertion Loss'!$F$17)*SQRT($E$3)","v":0},null,null,null,null,null,null,200,0,"",205,205,205,205,205,205,0,0,0,0,"N/A","?","?",null,0,1,1,1,1,1,1,1,1,1,1,1,1,1,1,1,1,1,1,1,1,1,1,1,1,1,1,1,null,11,null,false,false,false,false,false,false,null,null,{"$f":"ROW()","v":205},null,null,null,null,null,null,null,null,null,null,null,null,null,null,null,null,null,null,null,null,null,null,null,null,null,null,null,null,null,null,null,null,null,null,null,null,null,null,null,null,null,null,null,null,null,null,null,null,null,null,null,null,null,null,null,"?",0,"?","?","?",null,null,205,0,0,205,205,null,0,null,null,null,null,null,null,null,null,null,null,null,null,0]
[null,null,null,"N/A",{"$f":"((B206*SQRT($E$3*1000)+C206*$E$3*1000))/30480*Length*(1+'Cable Parameters'!I206/100*('Cable Parameters'!$E$1-25))+('Insertion Loss'!$F$16+'Insertion Loss'!$F$17)*SQRT($E$3)","v":0},null,null,null,null,null,null,201,0,"",206,206,206,206,206,206,0,0,0,0,"N/A","?","?",null,0,1,1,1,1,1,1,1,1,1,1,1,1,1,1,1,1,1,1,1,1,1,1,1,1,1,1,1,null,12,null,false,false,false,false,false,false,null,null,{"$f":"ROW()","v":206},null,null,null,null,null,null,null,null,null,null,null,null,null,null,null,null,null,null,null,null,null,null,null,null,null,null,null,null,null,null,null,null,null,null,null,null,null,null,null,null,null,null,null,null,null,null,null,null,null,null,null,null,null,null,null,"?",0,"?","?","?",null,null,206,0,0,206,206,null,0,null,null,null,null,null,null,null,null,null,null,null,null,0]
[null,null,null,"N/A",{"$f":"((B207*SQRT($E$3*1000)+C207*$E$3*1000))/30480*Length*(1+'Cable Parameters'!I207/100*('Cable Parameters'!$E$1-25))+('Insertion Loss'!$F$16+'Insertion Loss'!$F$17)*SQRT($E$3)","v":0},null,null,null,null,null,null,202,0,"",207,207,207,207,207,207,0,0,0,0,"N/A","?","?",null,0,1,1,1,1,1,1,1,1,1,1,1,1,1,1,1,1,1,1,1,1,1,1,1,1,1,1,1,null,13,null,false,false,false,false,false,false,null,null,{"$f":"ROW()","v":207},null,null,null,null,null,null,null,null,null,null,null,null,null,null,null,null,null,null,null,null,null,null,null,null,null,null,null,null,null,null,null,null,null,null,null,null,null,null,null,null,null,null,null,null,null,null,null,null,null,null,null,null,null,null,null,"?",0,"?","?","?",null,null,207,0,0,207,207,null,0,null,null,null,null,null,null,null,null,null,null,null,null,0]
[null,null,null,"N/A",{"$f":"((B208*SQRT($E$3*1000)+C208*$E$3*1000))/30480*Length*(1+'Cable Parameters'!I208/100*('Cable Parameters'!$E$1-25))+('Insertion Loss'!$F$16+'Insertion Loss'!$F$17)*SQRT($E$3)","v":0},null,null,null,null,null,null,203,0,"",208,208,208,208,208,208,0,0,0,0,"N/A","?","?",null,0,1,1,1,1,1,1,1,1,1,1,1,1,1,1,1,1,1,1,1,1,1,1,1,1,1,1,1,null,14,null,false,false,false,false,false,false,null,null,{"$f":"ROW()","v":208},null,null,null,null,null,null,null,null,null,null,null,null,null,null,null,null,null,null,null,null,null,null,null,null,null,null,null,null,null,null,null,null,null,null,null,null,null,null,null,null,null,null,null,null,null,null,null,null,null,null,null,null,null,null,null,"?",0,"?","?","?",null,null,208,0,0,208,208,null,0,null,null,null,null,null,null,null,null,null,null,null,null,0]
[null,null,null,"N/A",{"$f":"((B209*SQRT($E$3*1000)+C209*$E$3*1000))/30480*Length*(1+'Cable Parameters'!I209/100*('Cable Parameters'!$E$1-25))+('Insertion Loss'!$F$16+'Insertion Loss'!$F$17)*SQRT($E$3)","v":0},null,null,null,null,null,null,204,0,"",209,209,209,209,209,209,0,0,0,0,"N/A","?","?",null,0,1,1,1,1,1,1,1,1,1,1,1,1,1,1,1,1,1,1,1,1,1,1,1,1,1,1,1,null,15,null,false,false,false,false,false,false,null,null,{"$f":"ROW()","v":209},null,null,null,null,null,null,null,null,null,null,null,null,null,null,null,null,null,null,null,null,null,null,null,null,null,null,null,null,null,null,null,null,null,null,null,null,null,null,null,null,null,null,null,null,null,null,null,null,null,null,null,null,null,null,null,"?",0,"?","?","?",null,null,209,0,0,209,209,null,0,null,null,null,null,null,null,null,null,null,null,null,null,0]
[null,null,null,"N/A",{"$f":"((B210*SQRT($E$3*1000)+C210*$E$3*1000))/30480*Length*(1+'Cable Parameters'!I210/100*('Cable Parameters'!$E$1-25))+('Insertion Loss'!$F$16+'Insertion Loss'!$F$17)*SQRT($E$3)","v":0},null,null,null,null,null,null,205,0,"",210,210,210,210,210,210,0,0,0,0,"N/A","?","?",null,0,1,1,1,1,1,1,1,1,1,1,1,1,1,1,1,1,1,1,1,1,1,1,1,1,1,1,1,null,16,null,false,false,false,false,false,false,null,null,{"$f":"ROW()","v":210},null,null,null,null,null,null,null,null,null,null,null,null,null,null,null,null,null,null,null,null,null,null,null,null,null,null,null,null,null,null,null,null,null,null,null,null,null,null,null,null,null,null,null,null,null,null,null,null,null,null,null,null,null,null,null,"?",0,"?","?","?",null,null,210,0,0,210,210,null,0,null,null,null,null,null,null,null,null,null,null,null,null,0]
[null,null,null,"N/A",{"$f":"((B211*SQRT($E$3*1000)+C211*$E$3*1000))/30480*Length*(1+'Cable Parameters'!I211/100*('Cable Parameters'!$E$1-25))+('Insertion Loss'!$F$16+'Insertion Loss'!$F$17)*SQRT($E$3)","v":0},null,null,null,null,null,null,206,0,"",211,211,211,211,211,211,0,0,0,0,"N/A","?","?",null,0,1,1,1,1,1,1,1,1,1,1,1,1,1,1,1,1,1,1,1,1,1,1,1,1,1,1,1,null,17,null,false,false,false,false,false,false,null,null,{"$f":"ROW()","v":211},null,null,null,null,null,null,null,null,null,null,null,null,null,null,null,null,null,null,null,null,null,null,null,null,null,null,null,null,null,null,null,null,null,null,null,null,null,null,null,null,null,null,null,null,null,null,null,null,null,null,null,null,null,null,null,"?",0,"?","?","?",null,null,211,0,0,211,211,null,0,null,null,null,null,null,null,null,null,null,null,null,null,0]
[null,null,null,"N/A",{"$f":"((B212*SQRT($E$3*1000)+C212*$E$3*1000))/30480*Length*(1+'Cable Parameters'!I212/100*('Cable Parameters'!$E$1-25))+('Insertion Loss'!$F$16+'Insertion Loss'!$F$17)*SQRT($E$3)","v":0},null,null,null,null,null,null,207,0,"",212,212,212,212,212,212,0,0,0,0,"N/A","?","?",null,0,1,1,1,1,1,1,1,1,1,1,1,1,1,1,1,1,1,1,1,1,1,1,1,1,1,1,1,null,18,null,false,false,false,false,false,false,null,null,{"$f":"ROW()","v":212},null,null,null,null,null,null,null,null,null,null,null,null,null,null,null,null,null,null,null,null,null,null,null,null,null,null,null,null,null,null,null,null,null,null,null,null,null,null,null,null,null,null,null,null,null,null,null,null,null,null,null,null,null,null,null,"?",0,"?","?","?",null,null,212,0,0,212,212,null,0,null,null,null,null,null,null,null,null,null,null,null,null,0]
[null,null,null,"N/A",{"$f":"((B213*SQRT($E$3*1000)+C213*$E$3*1000))/30480*Length*(1+'Cable Parameters'!I213/100*('Cable Parameters'!$E$1-25))+('Insertion Loss'!$F$16+'Insertion Loss'!$F$17)*SQRT($E$3)","v":0},null,null,null,null,null,null,208,0,"",213,213,213,213,213,213,0,0,0,0,"N/A","?","?",null,0,1,1,1,1,1,1,1,1,1,1,1,1,1,1,1,1,1,1,1,1,1,1,1,1,1,1,1,null,19,null,false,false,false,false,false,false,null,null,{"$f":"ROW()","v":213},null,null,null,null,null,null,null,null,null,null,null,null,null,null,null,null,null,null,null,null,null,null,null,null,null,null,null,null,null,null,null,null,null,null,null,null,null,null,null,null,null,null,null,null,null,null,null,null,null,null,null,null,null,null,null,"?",0,"?","?","?",null,null,213,0,0,213,213,null,0,null,null,null,null,null,null,null,null,null,null,null,null,0]
[null,null,null,"N/A",{"$f":"((B214*SQRT($E$3*1000)+C214*$E$3*1000))/30480*Length*(1+'Cable Parameters'!I214/100*('Cable Parameters'!$E$1-25))+('Insertion Loss'!$F$16+'Insertion Loss'!$F$17)*SQRT($E$3)","v":0},null,null,null,null,null,null,209,0,"",214,214,214,214,214,214,0,0,0,0,"N/A","?","?",null,0,1,1,1,1,1,1,1,1,1,1,1,1,1,1,1,1,1,1,1,1,1,1,1,1,1,1,1,null,20,null,false,false,false,false,false,false,null,null,{"$f":"ROW()","v":214},null,null,null,null,null,null,null,null,null,null,null,null,null,null,null,null,null,null,null,null,null,null,null,null,null,null,null,null,null,null,null,null,null,null,null,null,null,null,null,null,null,null,null,null,null,null,null,null,null,null,null,null,null,null,null,"?",0,"?","?","?",null,null,214,0,0,214,214,null,0,null,null,null,null,null,null,null,null,null,null,null,null,0]
[null,null,null,"N/A",{"$f":"((B215*SQRT($E$3*1000)+C215*$E$3*1000))/30480*Length*(1+'Cable Parameters'!I215/100*('Cable Parameters'!$E$1-25))+('Insertion Loss'!$F$16+'Insertion Loss'!$F$17)*SQRT($E$3)","v":0},null,null,null,null,null,null,210,0,"",215,215,215,215,215,215,0,0,0,0,"N/A","?","?",null,0,1,1,1,1,1,1,1,1,1,1,1,1,1,1,1,1,1,1,1,1,1,1,1,1,1,1,1,null,21,null,false,false,false,false,false,false,null,null,{"$f":"ROW()","v":215},null,null,null,null,null,null,null,null,null,null,null,null,null,null,null,null,null,null,null,null,null,null,null,null,null,null,null,null,null,null,null,null,null,null,null,null,null,null,null,null,null,null,null,null,null,null,null,null,null,null,null,null,null,null,null,"?",0,"?","?","?",null,null,215,0,0,215,215,null,0,null,null,null,null,null,null,null,null,null,null,null,null,0]
[null,null,null,"N/A",{"$f":"((B216*SQRT($E$3*1000)+C216*$E$3*1000))/30480*Length*(1+'Cable Parameters'!I216/100*('Cable Parameters'!$E$1-25))+('Insertion Loss'!$F$16+'Insertion Loss'!$F$17)*SQRT($E$3)","v":0},null,null,null,null,null,null,211,0,"",216,216,216,216,216,216,0,0,0,0,"N/A","?","?",null,0,1,1,1,1,1,1,1,1,1,1,1,1,1,1,1,1,1,1,1,1,1,1,1,1,1,1,1,null,22,null,false,false,false,false,false,false,null,null,{"$f":"ROW()","v":216},null,null,null,null,null,null,null,null,null,null,null,null,null,null,null,null,null,null,null,null,null,null,null,null,null,null,null,null,null,null,null,null,null,null,null,null,null,null,null,null,null,null,null,null,null,null,null,null,null,null,null,null,null,null,null,"?",0,"?","?","?",null,null,216,0,0,216,216,null,0,null,null,null,null,null,null,null,null,null,null,null,null,0]
[null,null,null,"N/A",{"$f":"((B217*SQRT($E$3*1000)+C217*$E$3*1000))/30480*Length*(1+'Cable Parameters'!I217/100*('Cable Parameters'!$E$1-25))+('Insertion Loss'!$F$16+'Insertion Loss'!$F$17)*SQRT($E$3)","v":0},null,null,null,null,null,null,212,0,"",217,217,217,217,217,217,0,0,0,0,"N/A","?","?",null,0,1,1,1,1,1,1,1,1,1,1,1,1,1,1,1,1,1,1,1,1,1,1,1,1,1,1,1,null,23,null,false,false,false,false,false,false,null,null,{"$f":"ROW()","v":217},null,null,null,null,null,null,null,null,null,null,null,null,null,null,null,null,null,null,null,null,null,null,null,null,null,null,null,null,null,null,null,null,null,null,null,null,null,null,null,null,null,null,null,null,null,null,null,null,null,null,null,null,null,null,null,"?",0,"?","?","?",null,null,217,0,0,217,217,null,0,null,null,null,null,null,null,null,null,null,null,null,null,0]
[null,null,null,"N/A",{"$f":"((B218*SQRT($E$3*1000)+C218*$E$3*1000))/30480*Length*(1+'Cable Parameters'!I218/100*('Cable Parameters'!$E$1-25))+('Insertion Loss'!$F$16+'Insertion Loss'!$F$17)*SQRT($E$3)","v":0},null,null,null,null,null,null,213,0,"",218,218,218,218,218,218,0,0,0,0,"N/A","?","?",null,0,1,1,1,1,1,1,1,1,1,1,1,1,1,1,1,1,1,1,1,1,1,1,1,1,1,1,1,null,24,null,false,false,false,false,false,false,null,null,{"$f":"ROW()","v":218},null,null,null,null,null,null,null,null,null,null,null,null,null,null,null,null,null,null,null,null,null,null,null,null,null,null,null,null,null,null,null,null,null,null,null,null,null,null,null,null,null,null,null,null,null,null,null,null,null,null,null,null,null,null,null,"?",0,"?","?","?",null,null,218,0,0,218,218,null,0,null,null,null,null,null,null,null,null,null,null,null,null,0]
[null,null,null,"N/A",{"$f":"((B219*SQRT($E$3*1000)+C219*$E$3*1000))/30480*Length*(1+'Cable Parameters'!I219/100*('Cable Parameters'!$E$1-25))+('Insertion Loss'!$F$16+'Insertion Loss'!$F$17)*SQRT($E$3)","v":0},null,null,null,null,null,null,214,0,"",219,219,219,219,219,219,0,0,0,0,"N/A","?","?",null,0,1,1,1,1,1,1,1,1,1,1,1,1,1,1,1,1,1,1,1,1,1,1,1,1,1,1,1,null,25,null,false,false,false,false,false,false,null,null,{"$f":"ROW()","v":219},null,null,null,null,null,null,null,null,null,null,null,null,null,null,null,null,null,null,null,null,null,null,null,null,null,null,null,null,null,null,null,null,null,null,null,null,null,null,null,null,null,null,null,null,null,null,null,null,null,null,null,null,null,null,null,"?",0,"?","?","?",null,null,219,0,0,219,219,null,0,null,null,null,null,null,null,null,null,null,null,null,null,0]
[null,null,null,"N/A",{"$f":"((B220*SQRT($E$3*1000)+C220*$E$3*1000))/30480*Length*(1+'Cable Parameters'!I220/100*('Cable Parameters'!$E$1-25))+('Insertion Loss'!$F$16+'Insertion Loss'!$F$17)*SQRT($E$3)","v":0},null,null,null,null,null,null,215,0,"",220,220,220,220,220,220,0,0,0,0,"N/A","?","?",null,0,1,1,1,1,1,1,1,1,1,1,1,1,1,1,1,1,1,1,1,1,1,1,1,1,1,1,1,null,26,null,false,false,false,false,false,false,null,null,{"$f":"ROW()","v":220},null,null,null,null,null,null,null,null,null,null,null,null,null,null,null,null,null,null,null,null,null,null,null,null,null,null,null,null,null,null,null,null,null,null,null,null,null,null,null,null,null,null,null,null,null,null,null,null,null,null,null,null,null,null,null,"?",0,"?","?","?",null,null,220,0,0,220,220,null,0,null,null,null,null,null,null,null,null,null,null,null,null,0]

{"sheet":"filter","index":4,"n_rows":194,"n_cols":151,"rows_kept":194,"cut":false,"hidden":false,"merged":[[191,6,191,8],[192,6,192,8],[193,6,193,8],[3,10,5,11],[189,6,189,8],[190,6,190,8],[180,6,180,8],[181,6,181,8],[182,6,182,8],[183,6,183,8],[184,6,184,8],[185,6,185,8],[186,6,186,8],[187,6,187,8],[188,6,188,8],[176,6,176,8],[177,6,177,8],[178,6,178,8],[179,6,179,8],[163,6,163,8],[164,6,164,8],[165,6,165,8],[166,6,166,8],[167,6,167,8],[168,6,168,8],[169,6,169,8],[170,6,170,8],[175,6,175,8],[149,6,149,8],[150,6,150,8],[151,6,151,8],[152,6,152,8],[153,6,153,8],[154,6,154,8],[155,6,155,8],[156,6,156,8],[157,6,157,8],[171,6,171,8],[158,6,158,8],[159,6,159,8],[160,6,160,8],[161,6,161,8],[162,6,162,8],[172,6,172,8],[173,6,173,8],[174,6,174,8],[109,6,109,8],[98,6,98,8],[95,6,95,8],[96,6,96,8],[93,6,93,8],[145,6,145,8],[146,6,146,8],[147,6,147,8],[148,6,148,8],[103,6,103,8],[104,6,104,8],[101,6,101,8],[102,6,102,8],[99,6,99,8],[100,6,100,8],[97,6,97,8],[114,6,114,8],[111,6,111,8],[112,6,112,8],[144,6,144,8],[141,6,141,8],[142,6,142,8],[139,6,139,8],[133,6,133,8],[22,10,23,11],[21,6,21,8],[22,6,22,8],[119,6,119,8],[143,6,143,8],[117,6,117,8],[118,6,118,8],[115,6,115,8],[110,6,110,8],[107,6,107,8],[108,6,108,8],[105,6,105,8],[106,6,106,8],[140,6,140,8],[137,6,137,8],[138,6,138,8],[135,6,135,8],[136,6,136,8],[129,6,129,8],[130,6,130,8],[127,6,127,8],[128,6,128,8],[116,6,116,8],[113,6,113,8],[134,6,134,8],[131,6,131,8],[132,6,132,8],[120,6,120,8],[125,6,125,8],[126,6,126,8],[123,6,123,8],[124,6,124,8],[121,6,121,8],[122,6,122,8],[94,6,94,8],[91,6,91,8],[92,6,92,8],[89,6,89,8],[90,6,90,8],[87,6,87,8],[88,6,88,8],[85,6,85,8],[86,6,86,8],[83,6,83,8],[84,6,84,8],[81,6,81,8],[82,6,82,8],[79,6,79,8],[80,6,80,8],[77,6,77,8],[78,6,78,8],[75,6,75,8],[76,6,76,8],[73,6,73,8],[74,6,74,8],[71,6,71,8],[72,6,72,8],[69,6,69,8],[70,6,70,8],[67,6,67,8],[68,6,68,8],[65,6,65,8],[66,6,66,8],[63,6,63,8],[64,6,64,8],[61,6,61,8],[62,6,62,8],[59,6,59,8],[60,6,60,8],[57,6,57,8],[58,6,58,8],[55,6,55,8],[56,6,56,8],[53,6,53,8],[54,6,54,8],[51,6,51,8],[52,6,52,8],[49,6,49,8],[50,6,50,8],[47,6,47,8],[48,6,48,8],[45,6,45,8],[46,6,46,8],[43,6,43,8],[44,6,44,8],[41,6,41,8],[42,6,42,8],[39,6,39,8],[40,6,40,8],[37,6,37,8],[38,6,38,8],[35,6,35,8],[36,6,36,8],[5,3,6,3],[33,6,33,8],[34,6,34,8],[5,5,6,5],[31,6,31,8],[32,6,32,8],[29,6,29,8],[30,6,30,8],[27,6,27,8],[28,6,28,8],[25,6,25,8],[26,6,26,8],[23,6,23,8],[24,6,24,8],[7,6,7,8],[9,6,9,8],[8,6,8,8],[3,1,6,1],[25,10,26,11],[24,10,24,11],[5,2,6,2],[1,1,2,8],[19,6,19,8],[20,6,20,8],[17,6,17,8],[18,6,18,8],[15,6,15,8],[16,6,16,8],[14,6,14,8],[13,6,13,8],[10,6,10,8],[11,6,11,8],[12,6,12,8],[3,5,4,5],[3,4,4,4],[5,4,6,4],[5,6,6,6],[5,7,6,8],[3,6,4,8],[3,2,4,2],[3,3,4,3]]}
[null,null,null,null,null,null,null,null,null,null,null,null,null,null,null,null,null,null,null,null,null,null,null,null,1]
[null,"Select a Cable and Click Here ",null,null,null,null,null,null,null,null,null,null,null,"Number of cables:",null,null,null,null,"Indoor",0]
[null,null,null,null,null,null,null,null,null,null,null,null,null,{"$f":"COUNTA(G9:G194)-COUNTIF(G9:G194,\"\")","v":186},null,null,null,null,"Outdoor",null,null,null,null,null,null,null,null,null,null,null,null,null,null,null,null,null,null,null,null,null,null,null,null,null,null,null,null,null,null,null,null,null,null,null,null,null,null,null,null,null,null,null,null,null,null,null,null,null,null,null,null,null,null,null,null,null,null,null,null,null,null,null,null,null,null,null,null,null,null,null,null,null,null,null,null,null,null,null,null,null,null,null,null,null,null,null,null,null,null,null,null,null,null,null,null,null,null,null,null,null,null,null,null,null,null,null,null,null,null,null,null,null,null,null,null,null,null,null,null,null,null,null,null,null,null,null,null,null,null,null,"Outdoor Flexible Installation"]
[null,"Min. Bend Radius","Thick. Max.","In/Out door","CW Power Max.","Insertion Loss","Cable Type",null,null,null,"Filter Parameters",null,null,{"$f":"CONCATENATE(N3,\" / \",N5)","v":"186 / 186"},null,null,null,null,"All"]
[null,null,null,null,null,null,null,null,null,null,null,null,null,{"$f":"COUNTA('Cable Parameters'!A6:A300)","v":186}]
[null,null,{"$f":"IF(K18=\"\",\"\",K18)","v":""},{"$f":"IF(K12=\"\",\"\",K12)","v":"All"},"N/A",{"$f":"\"At :\" & K14 & \", \" &'Insertion Loss'!D39","v":"At :?, 25 °C"},{"$f":"N4","v":"186 / 186"},"Number of cables:"]
[]
[null,"mm","mm",null,null,{"$f":" \"db\"","v":"db"},{"$f":"K10","v":""},null,null,null,{"$f":"Length& \" mm\"","v":"1000 mm"},"Length"]
[null,{"$f":"'Cable Parameters'!AA6","v":9.52},{"$f":"'Cable Parameters'!W6","v":3},{"$f":"'Cable Parameters'!Z6","v":"Indoor Only"},{"$f":"'Cable Parameters'!Y6","v":"N/A"},{"$f":"IF(ISERROR('Cable Parameters'!X6),\"\",'Cable Parameters'!X6)","v":0},{"$f":"'Cable Parameters'!U6","v":"EZ_118_TP"}]
[null,{"$f":"'Cable Parameters'!AA7","v":6.35},{"$f":"'Cable Parameters'!W7","v":3.5},{"$f":"'Cable Parameters'!Z7","v":"Indoor Only"},{"$f":"'Cable Parameters'!Y7","v":"N/A"},{"$f":"IF(ISERROR('Cable Parameters'!X7),\"\",'Cable Parameters'!X7)","v":0},{"$f":"'Cable Parameters'!U7","v":"EZ_141_TP_M17"},null,null,null,{"$f":"IF('Cable Parameters'!EU3=\"\",\"\", 'Cable Parameters'!EU3)","v":""},"Application"]
[null,{"$f":"'Cable Parameters'!AA8","v":19.100000000000001},{"$f":"'Cable Parameters'!W8","v":6.4},{"$f":"'Cable Parameters'!Z8","v":"Indoor Only"},{"$f":"'Cable Parameters'!Y8","v":"N/A"},{"$f":"IF(ISERROR('Cable Parameters'!X8),\"\",'Cable Parameters'!X8)","v":0},{"$f":"'Cable Parameters'!U8","v":"EZ_250_AL_TP"}]
[null,{"$f":"'Cable Parameters'!AA9","v":9.25},{"$f":"'Cable Parameters'!W9","v":6.4},{"$f":"'Cable Parameters'!Z9","v":"Indoor Only"},{"$f":"'Cable Parameters'!Y9","v":"N/A"},{"$f":"IF(ISERROR('Cable Parameters'!X9),\"\",'Cable Parameters'!X9)","v":0},{"$f":"'Cable Parameters'!U9","v":"EZ_250_TP_M17"},null,null,null,{"$f":"IF('Cable Parameters'!Q2=\"\",\"All\",IF('Cable Parameters'!Q2=1,\"Indoor\",\"Outdoor\"))","v":"All"},"In/Out door"]
[null,{"$f":"'Cable Parameters'!AA10","v":1.27},{"$f":"'Cable Parameters'!W10","v":1.2},{"$f":"'Cable Parameters'!Z10","v":"Indoor Only"},{"$f":"'Cable Parameters'!Y10","v":"N/A"},{"$f":"IF(ISERROR('Cable Parameters'!X10),\"\",'Cable Parameters'!X10)","v":0},{"$f":"'Cable Parameters'!U10","v":"EZ_47_AL_TP"}]
[null,{"$f":"'Cable Parameters'!AA11","v":3.18},{"$f":"'Cable Parameters'!W11","v":1.2},{"$f":"'Cable Parameters'!Z11","v":"Indoor Only"},{"$f":"'Cable Parameters'!Y11","v":"N/A"},{"$f":"IF(ISERROR('Cable Parameters'!X11),\"\",'Cable Parameters'!X11)","v":0},{"$f":"'Cable Parameters'!U11","v":"EZ_47_TP_M17"},null,null,null,{"$f":"IF( 'Cable Parameters'!P2=\"\",\"?\", 'Cable Parameters'!P2& \" GHz\")","v":"?"},"Freq. Max."]
[null,{"$f":"'Cable Parameters'!AA12","v":1.77},{"$f":"'Cable Parameters'!W12","v":2.2000000000000002},{"$f":"'Cable Parameters'!Z12","v":"Indoor Only"},{"$f":"'Cable Parameters'!Y12","v":"N/A"},{"$f":"IF(ISERROR('Cable Parameters'!X12),\"\",'Cable Parameters'!X12)","v":0},{"$f":"'Cable Parameters'!U12","v":"EZ_86_AL_TP_M17"}]
[null,{"$f":"'Cable Parameters'!AA13","v":1.27},{"$f":"'Cable Parameters'!W13","v":2.2000000000000002},{"$f":"'Cable Parameters'!Z13","v":"Indoor Only"},{"$f":"'Cable Parameters'!Y13","v":"N/A"},{"$f":"IF(ISERROR('Cable Parameters'!X13),\"\",'Cable Parameters'!X13)","v":0},{"$f":"'Cable Parameters'!U13","v":"EZ_86_TP_M17"},null,null,null,{"$f":"IF('Cable Parameters'!R2=\"\",\"\", 'Cable Parameters'!R2)","v":"N/A"},"CW Power Max."]
[null,{"$f":"'Cable Parameters'!AA14","v":3.17},{"$f":"'Cable Parameters'!W14","v":4},{"$f":"'Cable Parameters'!Z14","v":"Indoor Only"},{"$f":"'Cable Parameters'!Y14","v":"N/A"},{"$f":"IF(ISERROR('Cable Parameters'!X14),\"\",'Cable Parameters'!X14)","v":0},{"$f":"'Cable Parameters'!U14","v":"EZ141_AL_TP_M17"}]
[null,{"$f":"'Cable Parameters'!AA15","v":9.65},{"$f":"'Cable Parameters'!W15","v":2.21},{"$f":"'Cable Parameters'!Z15","v":"In/Out door"},{"$f":"'Cable Parameters'!Y15","v":"N/A"},{"$f":"IF(ISERROR('Cable Parameters'!X15),\"\",'Cable Parameters'!X15)","v":0},{"$f":"'Cable Parameters'!U15","v":"HF HeliFoil 090"},null,null,null,{"$f":"IF('Cable Parameters'!S2=\"\",\"\",'Cable Parameters'!S2 & \" \" & \" ±1 mm\")","v":""},"Thick. Max."]
[null,{"$f":"'Cable Parameters'!AA16","v":19.05},{"$f":"'Cable Parameters'!W16","v":3.81},{"$f":"'Cable Parameters'!Z16","v":"In/Out door"},{"$f":"'Cable Parameters'!Y16","v":"N/A"},{"$f":"IF(ISERROR('Cable Parameters'!X16),\"\",'Cable Parameters'!X16)","v":0},{"$f":"'Cable Parameters'!U16","v":"HF HeliFoil 160"}]
[null,{"$f":"'Cable Parameters'!AA17","v":25.4},{"$f":"'Cable Parameters'!W17","v":5},{"$f":"'Cable Parameters'!Z17","v":"In/Out door"},{"$f":"'Cable Parameters'!Y17","v":"N/A"},{"$f":"IF(ISERROR('Cable Parameters'!X17),\"\",'Cable Parameters'!X17)","v":0},{"$f":"'Cable Parameters'!U17","v":"HF HeliFoil 190"}]
[null,{"$f":"'Cable Parameters'!AA18","v":38.1},{"$f":"'Cable Parameters'!W18","v":7.6},{"$f":"'Cable Parameters'!Z18","v":"In/Out door"},{"$f":"'Cable Parameters'!Y18","v":"N/A"},{"$f":"IF(ISERROR('Cable Parameters'!X18),\"\",'Cable Parameters'!X18)","v":0},{"$f":"'Cable Parameters'!U18","v":"HF HeliFoil 290"}]
[null,{"$f":"'Cable Parameters'!AA19","v":50.8},{"$f":"'Cable Parameters'!W19","v":9},{"$f":"'Cable Parameters'!Z19","v":"In/Out door"},{"$f":"'Cable Parameters'!Y19","v":"N/A"},{"$f":"IF(ISERROR('Cable Parameters'!X19),\"\",'Cable Parameters'!X19)","v":0},{"$f":"'Cable Parameters'!U19","v":"HF HeliFoil 290PUR"}]
[null,{"$f":"'Cable Parameters'!AA20","v":279.39999999999998},{"$f":"'Cable Parameters'!W20","v":30.48},{"$f":"'Cable Parameters'!Z20","v":"In/Out door"},{"$f":"'Cable Parameters'!Y20","v":"N/A"},{"$f":"IF(ISERROR('Cable Parameters'!X20),\"\",'Cable Parameters'!X20)","v":0},{"$f":"'Cable Parameters'!U20","v":"LLSB-1200"}]
[null,{"$f":"'Cable Parameters'!AA21","v":101.6},{"$f":"'Cable Parameters'!W21","v":10.199999999999999},{"$f":"'Cable Parameters'!Z21","v":"In/Out door"},{"$f":"'Cable Parameters'!Y21","v":"N/A"},{"$f":"IF(ISERROR('Cable Parameters'!X21),\"\",'Cable Parameters'!X21)","v":0},{"$f":"'Cable Parameters'!U21","v":"LLSB-400"}]
[null,{"$f":"'Cable Parameters'!AA22","v":152.4},{"$f":"'Cable Parameters'!W22","v":15},{"$f":"'Cable Parameters'!Z22","v":"In/Out door"},{"$f":"'Cable Parameters'!Y22","v":"N/A"},{"$f":"IF(ISERROR('Cable Parameters'!X22),\"\",'Cable Parameters'!X22)","v":0},{"$f":"'Cable Parameters'!U22","v":"LLSB-600"},null,null,null,"Filter By Name"]
[null,{"$f":"'Cable Parameters'!AA23","v":228.6},{"$f":"'Cable Parameters'!W23","v":22.1},{"$f":"'Cable Parameters'!Z23","v":"In/Out door"},{"$f":"'Cable Parameters'!Y23","v":"N/A"},{"$f":"IF(ISERROR('Cable Parameters'!X23),\"\",'Cable Parameters'!X23)","v":0},{"$f":"'Cable Parameters'!U23","v":"LLSB-900"}]
[null,{"$f":"'Cable Parameters'!AA24","v":101.6},{"$f":"'Cable Parameters'!W24","v":10},{"$f":"'Cable Parameters'!Z24","v":"In/Out door"},{"$f":"'Cable Parameters'!Y24","v":"N/A"},{"$f":"IF(ISERROR('Cable Parameters'!X24),\"\",'Cable Parameters'!X24)","v":0},{"$f":"'Cable Parameters'!U24","v":"LMR 400"}]
[null,{"$f":"'Cable Parameters'!AA25","v":101.6},{"$f":"'Cable Parameters'!W25","v":10},{"$f":"'Cable Parameters'!Z25","v":"In/Out door"},{"$f":"'Cable Parameters'!Y25","v":"N/A"},{"$f":"IF(ISERROR('Cable Parameters'!X25),\"\",'Cable Parameters'!X25)","v":0},{"$f":"'Cable Parameters'!U25","v":"LMR 400 UF"}]
[null,{"$f":"'Cable Parameters'!AA26","v":152.4},{"$f":"'Cable Parameters'!W26","v":15},{"$f":"'Cable Parameters'!Z26","v":"In/Out door"},{"$f":"'Cable Parameters'!Y26","v":"N/A"},{"$f":"IF(ISERROR('Cable Parameters'!X26),\"\",'Cable Parameters'!X26)","v":0},{"$f":"'Cable Parameters'!U26","v":"LMR 600"}]
[null,{"$f":"'Cable Parameters'!AA27","v":152.4},{"$f":"'Cable Parameters'!W27","v":15},{"$f":"'Cable Parameters'!Z27","v":"In/Out door"},{"$f":"'Cable Parameters'!Y27","v":"N/A"},{"$f":"IF(ISERROR('Cable Parameters'!X27),\"\",'Cable Parameters'!X27)","v":0},{"$f":"'Cable Parameters'!U27","v":"LMR 600 UF"}]
[null,{"$f":"'Cable Parameters'!AA28","v":228.6},{"$f":"'Cable Parameters'!W28","v":22},{"$f":"'Cable Parameters'!Z28","v":"In/Out door"},{"$f":"'Cable Parameters'!Y28","v":"N/A"},{"$f":"IF(ISERROR('Cable Parameters'!X28),\"\",'Cable Parameters'!X28)","v":0},{"$f":"'Cable Parameters'!U28","v":"LMR 900"}]
[null,{"$f":"'Cable Parameters'!AA29","v":279.39999999999998},{"$f":"'Cable Parameters'!W29","v":30},{"$f":"'Cable Parameters'!Z29","v":"In/Out door"},{"$f":"'Cable Parameters'!Y29","v":"N/A"},{"$f":"IF(ISERROR('Cable Parameters'!X29),\"\",'Cable Parameters'!X29)","v":0},{"$f":"'Cable Parameters'!U29","v":"LMR 1200"}]
[null,{"$f":"'Cable Parameters'!AA30","v":25.4},{"$f":"'Cable Parameters'!W30","v":10.29},{"$f":"'Cable Parameters'!Z30","v":"In/Out door"},{"$f":"'Cable Parameters'!Y30","v":"N/A"},{"$f":"IF(ISERROR('Cable Parameters'!X30),\"\",'Cable Parameters'!X30)","v":0},{"$f":"'Cable Parameters'!U30","v":"LMR-400-FR"}]
[null,{"$f":"'Cable Parameters'!AA31","v":31.8},{"$f":"'Cable Parameters'!W31","v":12.7},{"$f":"'Cable Parameters'!Z31","v":"In/Out door"},{"$f":"'Cable Parameters'!Y31","v":"N/A"},{"$f":"IF(ISERROR('Cable Parameters'!X31),\"\",'Cable Parameters'!X31)","v":0},{"$f":"'Cable Parameters'!U31","v":"LMR-500-FR"}]
[null,{"$f":"'Cable Parameters'!AA32","v":38.1},{"$f":"'Cable Parameters'!W32","v":15},{"$f":"'Cable Parameters'!Z32","v":"In/Out door"},{"$f":"'Cable Parameters'!Y32","v":"N/A"},{"$f":"IF(ISERROR('Cable Parameters'!X32),\"\",'Cable Parameters'!X32)","v":0},{"$f":"'Cable Parameters'!U32","v":"LMR-600-FR"}]
[null,{"$f":"'Cable Parameters'!AA33","v":76.2},{"$f":"'Cable Parameters'!W33","v":22.1},{"$f":"'Cable Parameters'!Z33","v":"In/Out door"},{"$f":"'Cable Parameters'!Y33","v":"N/A"},{"$f":"IF(ISERROR('Cable Parameters'!X33),\"\",'Cable Parameters'!X33)","v":0},{"$f":"'Cable Parameters'!U33","v":"LMR-900-FR"}]
[null,{"$f":"'Cable Parameters'!AA34","v":165.1},{"$f":"'Cable Parameters'!W34","v":30.48},{"$f":"'Cable Parameters'!Z34","v":"In/Out door"},{"$f":"'Cable Parameters'!Y34","v":"N/A"},{"$f":"IF(ISERROR('Cable Parameters'!X34),\"\",'Cable Parameters'!X34)","v":0},{"$f":"'Cable Parameters'!U34","v":"LMR-1200-FR"}]
[null,{"$f":"'Cable Parameters'!AA35","v":101.6},{"$f":"'Cable Parameters'!W35","v":10.28},{"$f":"'Cable Parameters'!Z35","v":"In/Out door"},{"$f":"'Cable Parameters'!Y35","v":"N/A"},{"$f":"IF(ISERROR('Cable Parameters'!X35),\"\",'Cable Parameters'!X35)","v":0},{"$f":"'Cable Parameters'!U35","v":"LMR-400-LLPL"}]
[null,{"$f":"'Cable Parameters'!AA36","v":127},{"$f":"'Cable Parameters'!W36","v":12.7},{"$f":"'Cable Parameters'!Z36","v":"In/Out door"},{"$f":"'Cable Parameters'!Y36","v":"N/A"},{"$f":"IF(ISERROR('Cable Parameters'!X36),\"\",'Cable Parameters'!X36)","v":0},{"$f":"'Cable Parameters'!U36","v":"LMR-500-LLPL"}]
[null,{"$f":"'Cable Parameters'!AA37","v":152.4},{"$f":"'Cable Parameters'!W37","v":15},{"$f":"'Cable Parameters'!Z37","v":"In/Out door"},{"$f":"'Cable Parameters'!Y37","v":"N/A"},{"$f":"IF(ISERROR('Cable Parameters'!X37),\"\",'Cable Parameters'!X37)","v":0},{"$f":"'Cable Parameters'!U37","v":"LMR-600-LLPL"}]
[null,{"$f":"'Cable Parameters'!AA38","v":228.6},{"$f":"'Cable Parameters'!W38","v":22.1},{"$f":"'Cable Parameters'!Z38","v":"In/Out door"},{"$f":"'Cable Parameters'!Y38","v":"N/A"},{"$f":"IF(ISERROR('Cable Parameters'!X38),\"\",'Cable Parameters'!X38)","v":0},{"$f":"'Cable Parameters'!U38","v":"LMR-900-LLPL"}]
[null,{"$f":"'Cable Parameters'!AA39","v":304.8},{"$f":"'Cable Parameters'!W39","v":30},{"$f":"'Cable Parameters'!Z39","v":"In/Out door"},{"$f":"'Cable Parameters'!Y39","v":"N/A"},{"$f":"IF(ISERROR('Cable Parameters'!X39),\"\",'Cable Parameters'!X39)","v":0},{"$f":"'Cable Parameters'!U39","v":"LMR-1200-LLPL"}]
[null,{"$f":"'Cable Parameters'!AA40","v":342.9},{"$f":"'Cable Parameters'!W40","v":40.64},{"$f":"'Cable Parameters'!Z40","v":"In/Out door"},{"$f":"'Cable Parameters'!Y40","v":"N/A"},{"$f":"IF(ISERROR('Cable Parameters'!X40),\"\",'Cable Parameters'!X40)","v":0},{"$f":"'Cable Parameters'!U40","v":"LMR-1700-DB-TPV"}]
[null,{"$f":"'Cable Parameters'!AA41","v":19},{"$f":"'Cable Parameters'!W41","v":4},{"$f":"'Cable Parameters'!Z41","v":"In/Out door"},{"$f":"'Cable Parameters'!Y41","v":"N/A"},{"$f":"IF(ISERROR('Cable Parameters'!X41),\"\",'Cable Parameters'!X41)","v":0},{"$f":"'Cable Parameters'!U41","v":"MaxGain160"}]
[null,{"$f":"'Cable Parameters'!AA42","v":31.75},{"$f":"'Cable Parameters'!W42","v":5},{"$f":"'Cable Parameters'!Z42","v":"In/Out door"},{"$f":"'Cable Parameters'!Y42","v":"N/A"},{"$f":"IF(ISERROR('Cable Parameters'!X42),\"\",'Cable Parameters'!X42)","v":0},{"$f":"'Cable Parameters'!U42","v":"MaxGain200"}]
[null,{"$f":"'Cable Parameters'!AA43","v":44.45},{"$f":"'Cable Parameters'!W43","v":7.6},{"$f":"'Cable Parameters'!Z43","v":"In/Out door"},{"$f":"'Cable Parameters'!Y43","v":"N/A"},{"$f":"IF(ISERROR('Cable Parameters'!X43),\"\",'Cable Parameters'!X43)","v":0},{"$f":"'Cable Parameters'!U43","v":"MaxGain300"}]
[null,{"$f":"'Cable Parameters'!AA44","v":44.45},{"$f":"'Cable Parameters'!W44","v":7.6},{"$f":"'Cable Parameters'!Z44","v":"In/Out door"},{"$f":"'Cable Parameters'!Y44","v":"N/A"},{"$f":"IF(ISERROR('Cable Parameters'!X44),\"\",'Cable Parameters'!X44)","v":0},{"$f":"'Cable Parameters'!U44","v":"MaxGain300S"}]
[null,{"$f":"'Cable Parameters'!AA45","v":19.05},{"$f":"'Cable Parameters'!W45","v":4},{"$f":"'Cable Parameters'!Z45","v":"In/Out door"},{"$f":"'Cable Parameters'!Y45","v":"N/A"},{"$f":"IF(ISERROR('Cable Parameters'!X45),\"\",'Cable Parameters'!X45)","v":0},{"$f":"'Cable Parameters'!U45","v":"MilTech 160"}]
[null,{"$f":"'Cable Parameters'!AA46","v":28.574999999999999},{"$f":"'Cable Parameters'!W46","v":5.3},{"$f":"'Cable Parameters'!Z46","v":"In/Out door"},{"$f":"'Cable Parameters'!Y46","v":"N/A"},{"$f":"IF(ISERROR('Cable Parameters'!X46),\"\",'Cable Parameters'!X46)","v":0},{"$f":"'Cable Parameters'!U46","v":"MilTech 210     "}]
[null,{"$f":"'Cable Parameters'!AA47","v":28.574999999999999},{"$f":"'Cable Parameters'!W47","v":5.8},{"$f":"'Cable Parameters'!Z47","v":"In/Out door"},{"$f":"'Cable Parameters'!Y47","v":"N/A"},{"$f":"IF(ISERROR('Cable Parameters'!X47),\"\",'Cable Parameters'!X47)","v":0},{"$f":"'Cable Parameters'!U47","v":"MilTech 230"}]
[null,{"$f":"'Cable Parameters'!AA48","v":33.32},{"$f":"'Cable Parameters'!W48","v":6.7},{"$f":"'Cable Parameters'!Z48","v":"In/Out door"},{"$f":"'Cable Parameters'!Y48","v":"N/A"},{"$f":"IF(ISERROR('Cable Parameters'!X48),\"\",'Cable Parameters'!X48)","v":0},{"$f":"'Cable Parameters'!U48","v":"MilTech 265"}]
[null,{"$f":"'Cable Parameters'!AA49","v":44.45},{"$f":"'Cable Parameters'!W49","v":7.9},{"$f":"'Cable Parameters'!Z49","v":"In/Out door"},{"$f":"'Cable Parameters'!Y49","v":"N/A"},{"$f":"IF(ISERROR('Cable Parameters'!X49),\"\",'Cable Parameters'!X49)","v":0},{"$f":"'Cable Parameters'!U49","v":"MilTech 300"}]
[null,{"$f":"'Cable Parameters'!AA50","v":44.45},{"$f":"'Cable Parameters'!W50","v":8.6},{"$f":"'Cable Parameters'!Z50","v":"In/Out door"},{"$f":"'Cable Parameters'!Y50","v":"N/A"},{"$f":"IF(ISERROR('Cable Parameters'!X50),\"\",'Cable Parameters'!X50)","v":0},{"$f":"'Cable Parameters'!U50","v":"MilTech 340"}]
[null,{"$f":"'Cable Parameters'!AA51","v":"N/A"},{"$f":"'Cable Parameters'!W51","v":8.6},{"$f":"'Cable Parameters'!Z51","v":"In/Out door"},{"$f":"'Cable Parameters'!Y51","v":"N/A"},{"$f":"IF(ISERROR('Cable Parameters'!X51),\"\",'Cable Parameters'!X51)","v":0},{"$f":"'Cable Parameters'!U51","v":"MilTech 340EL"}]
[null,{"$f":"'Cable Parameters'!AA52","v":"N/A"},{"$f":"'Cable Parameters'!W52","v":8.6},{"$f":"'Cable Parameters'!Z52","v":"In/Out door"},{"$f":"'Cable Parameters'!Y52","v":"N/A"},{"$f":"IF(ISERROR('Cable Parameters'!X52),\"\",'Cable Parameters'!X52)","v":0},{"$f":"'Cable Parameters'!U52","v":"MilTech 340XL"}]
[null,{"$f":"'Cable Parameters'!AA53","v":60.32},{"$f":"'Cable Parameters'!W53","v":12.32},{"$f":"'Cable Parameters'!Z53","v":"In/Out door"},{"$f":"'Cable Parameters'!Y53","v":"N/A"},{"$f":"IF(ISERROR('Cable Parameters'!X53),\"\",'Cable Parameters'!X53)","v":0},{"$f":"'Cable Parameters'!U53","v":"MilTech 480"}]
[null,{"$f":"'Cable Parameters'!AA54","v":101.6},{"$f":"'Cable Parameters'!W54","v":16.64},{"$f":"'Cable Parameters'!Z54","v":"In/Out door"},{"$f":"'Cable Parameters'!Y54","v":"N/A"},{"$f":"IF(ISERROR('Cable Parameters'!X54),\"\",'Cable Parameters'!X54)","v":0},{"$f":"'Cable Parameters'!U54","v":"MilTech 650"}]
[null,{"$f":"'Cable Parameters'!AA55","v":25.4},{"$f":"'Cable Parameters'!W55","v":5.3},{"$f":"'Cable Parameters'!Z55","v":"In/Out door"},{"$f":"'Cable Parameters'!Y55","v":"N/A"},{"$f":"IF(ISERROR('Cable Parameters'!X55),\"\",'Cable Parameters'!X55)","v":0},{"$f":"'Cable Parameters'!U55","v":"MilTech light MTL210"}]
[null,{"$f":"'Cable Parameters'!AA56","v":28.574999999999999},{"$f":"'Cable Parameters'!W56","v":5.8},{"$f":"'Cable Parameters'!Z56","v":"In/Out door"},{"$f":"'Cable Parameters'!Y56","v":"N/A"},{"$f":"IF(ISERROR('Cable Parameters'!X56),\"\",'Cable Parameters'!X56)","v":0},{"$f":"'Cable Parameters'!U56","v":"MilTech light MTL230"}]
[null,{"$f":"'Cable Parameters'!AA57","v":31.75},{"$f":"'Cable Parameters'!W57","v":6.9},{"$f":"'Cable Parameters'!Z57","v":"In/Out door"},{"$f":"'Cable Parameters'!Y57","v":"N/A"},{"$f":"IF(ISERROR('Cable Parameters'!X57),\"\",'Cable Parameters'!X57)","v":0},{"$f":"'Cable Parameters'!U57","v":"MilTech light MTL270"}]
[null,{"$f":"'Cable Parameters'!AA58","v":44.45},{"$f":"'Cable Parameters'!W58","v":8.6},{"$f":"'Cable Parameters'!Z58","v":"In/Out door"},{"$f":"'Cable Parameters'!Y58","v":"N/A"},{"$f":"IF(ISERROR('Cable Parameters'!X58),\"\",'Cable Parameters'!X58)","v":0},{"$f":"'Cable Parameters'!U58","v":"MilTech light MTL330"}]
[null,{"$f":"'Cable Parameters'!AA59","v":63.5},{"$f":"'Cable Parameters'!W59","v":11},{"$f":"'Cable Parameters'!Z59","v":"In/Out door"},{"$f":"'Cable Parameters'!Y59","v":"N/A"},{"$f":"IF(ISERROR('Cable Parameters'!X59),\"\",'Cable Parameters'!X59)","v":0},{"$f":"'Cable Parameters'!U59","v":"MilTech light MTL440"}]
[null,{"$f":"'Cable Parameters'!AA60","v":44.45},{"$f":"'Cable Parameters'!W60","v":8.8000000000000007},{"$f":"'Cable Parameters'!Z60","v":"In/Out door"},{"$f":"'Cable Parameters'!Y60","v":"N/A"},{"$f":"IF(ISERROR('Cable Parameters'!X60),\"\",'Cable Parameters'!X60)","v":0},{"$f":"'Cable Parameters'!U60","v":"MilTech 340-LS/ZHAL "}]
[null,{"$f":"'Cable Parameters'!AA61","v":3.81},{"$f":"'Cable Parameters'!W61","v":1.19},{"$f":"'Cable Parameters'!Z61","v":"In/Out door"},{"$f":"'Cable Parameters'!Y61","v":"N/A"},{"$f":"IF(ISERROR('Cable Parameters'!X61),\"\",'Cable Parameters'!X61)","v":0},{"$f":"'Cable Parameters'!U61","v":"PhaseTrack   SR PTSRB047"}]
[null,{"$f":"'Cable Parameters'!AA62","v":6.35},{"$f":"'Cable Parameters'!W62","v":2.16},{"$f":"'Cable Parameters'!Z62","v":"In/Out door"},{"$f":"'Cable Parameters'!Y62","v":"N/A"},{"$f":"IF(ISERROR('Cable Parameters'!X62),\"\",'Cable Parameters'!X62)","v":0},{"$f":"'Cable Parameters'!U62","v":"PhaseTrack   SR PTSRB085"}]
[null,{"$f":"'Cable Parameters'!AA63","v":10.795},{"$f":"'Cable Parameters'!W63","v":3.58},{"$f":"'Cable Parameters'!Z63","v":"In/Out door"},{"$f":"'Cable Parameters'!Y63","v":"N/A"},{"$f":"IF(ISERROR('Cable Parameters'!X63),\"\",'Cable Parameters'!X63)","v":0},{"$f":"'Cable Parameters'!U63","v":"PhaseTrack   SR PTSRB141"}]
[null,{"$f":"'Cable Parameters'!AA64","v":6.35},{"$f":"'Cable Parameters'!W64","v":1.62},{"$f":"'Cable Parameters'!Z64","v":"In/Out door"},{"$f":"'Cable Parameters'!Y64","v":"N/A"},{"$f":"IF(ISERROR('Cable Parameters'!X64),\"\",'Cable Parameters'!X64)","v":0},{"$f":"'Cable Parameters'!U64","v":"PhaseTrack  PF 047"}]
[null,{"$f":"'Cable Parameters'!AA65","v":15.875},{"$f":"'Cable Parameters'!W65","v":3.3},{"$f":"'Cable Parameters'!Z65","v":"In/Out door"},{"$f":"'Cable Parameters'!Y65","v":"N/A"},{"$f":"IF(ISERROR('Cable Parameters'!X65),\"\",'Cable Parameters'!X65)","v":0},{"$f":"'Cable Parameters'!U65","v":"PhaseTrack  PF 130"}]
[null,{"$f":"'Cable Parameters'!AA66","v":19.05},{"$f":"'Cable Parameters'!W66","v":4},{"$f":"'Cable Parameters'!Z66","v":"In/Out door"},{"$f":"'Cable Parameters'!Y66","v":"N/A"},{"$f":"IF(ISERROR('Cable Parameters'!X66),\"\",'Cable Parameters'!X66)","v":0},{"$f":"'Cable Parameters'!U66","v":"PhaseTrack  PF 402"}]
[null,{"$f":"'Cable Parameters'!AA67","v":12.7},{"$f":"'Cable Parameters'!W67","v":2.38},{"$f":"'Cable Parameters'!Z67","v":"In/Out door"},{"$f":"'Cable Parameters'!Y67","v":"N/A"},{"$f":"IF(ISERROR('Cable Parameters'!X67),\"\",'Cable Parameters'!X67)","v":0},{"$f":"'Cable Parameters'!U67","v":"PhaseTrack  PF 405"}]
[null,{"$f":"'Cable Parameters'!AA68","v":44.45},{"$f":"'Cable Parameters'!W68","v":8},{"$f":"'Cable Parameters'!Z68","v":"In/Out door"},{"$f":"'Cable Parameters'!Y68","v":"N/A"},{"$f":"IF(ISERROR('Cable Parameters'!X68),\"\",'Cable Parameters'!X68)","v":0},{"$f":"'Cable Parameters'!U68","v":"PhaseTrack  PT 318"}]
[null,{"$f":"'Cable Parameters'!AA69","v":13.97},{"$f":"'Cable Parameters'!W69","v":2.74},{"$f":"'Cable Parameters'!Z69","v":"In/Out door"},{"$f":"'Cable Parameters'!Y69","v":"N/A"},{"$f":"IF(ISERROR('Cable Parameters'!X69),\"\",'Cable Parameters'!X69)","v":0},{"$f":"'Cable Parameters'!U69","v":"PhaseTrack  PT110"}]
[null,{"$f":"'Cable Parameters'!AA70","v":19.05},{"$f":"'Cable Parameters'!W70","v":3.68},{"$f":"'Cable Parameters'!Z70","v":"In/Out door"},{"$f":"'Cable Parameters'!Y70","v":"N/A"},{"$f":"IF(ISERROR('Cable Parameters'!X70),\"\",'Cable Parameters'!X70)","v":0},{"$f":"'Cable Parameters'!U70","v":"PhaseTrack  PT130"}]
[null,{"$f":"'Cable Parameters'!AA71","v":19.05},{"$f":"'Cable Parameters'!W71","v":3.68},{"$f":"'Cable Parameters'!Z71","v":"In/Out door"},{"$f":"'Cable Parameters'!Y71","v":"N/A"},{"$f":"IF(ISERROR('Cable Parameters'!X71),\"\",'Cable Parameters'!X71)","v":0},{"$f":"'Cable Parameters'!U71","v":"PhaseTrack  PT150"}]
[null,{"$f":"'Cable Parameters'!AA72","v":25.4},{"$f":"'Cable Parameters'!W72","v":4.57},{"$f":"'Cable Parameters'!Z72","v":"In/Out door"},{"$f":"'Cable Parameters'!Y72","v":"N/A"},{"$f":"IF(ISERROR('Cable Parameters'!X72),\"\",'Cable Parameters'!X72)","v":0},{"$f":"'Cable Parameters'!U72","v":"PhaseTrack  PT180"}]
[null,{"$f":"'Cable Parameters'!AA73","v":28.574999999999999},{"$f":"'Cable Parameters'!W73","v":5.58},{"$f":"'Cable Parameters'!Z73","v":"In/Out door"},{"$f":"'Cable Parameters'!Y73","v":"N/A"},{"$f":"IF(ISERROR('Cable Parameters'!X73),\"\",'Cable Parameters'!X73)","v":0},{"$f":"'Cable Parameters'!U73","v":"PhaseTrack  PT210"}]
[null,{"$f":"'Cable Parameters'!AA74","v":101.6},{"$f":"'Cable Parameters'!W74","v":10.16},{"$f":"'Cable Parameters'!Z74","v":"In/Out door"},{"$f":"'Cable Parameters'!Y74","v":"N/A"},{"$f":"IF(ISERROR('Cable Parameters'!X74),\"\",'Cable Parameters'!X74)","v":0},{"$f":"'Cable Parameters'!U74","v":"PhaseTrack  PTLS 400"}]
[null,{"$f":"'Cable Parameters'!AA75","v":152.4},{"$f":"'Cable Parameters'!W75","v":15.24},{"$f":"'Cable Parameters'!Z75","v":"In/Out door"},{"$f":"'Cable Parameters'!Y75","v":"N/A"},{"$f":"IF(ISERROR('Cable Parameters'!X75),\"\",'Cable Parameters'!X75)","v":0},{"$f":"'Cable Parameters'!U75","v":"PhaseTrack  PTLS 600"}]
[null,{"$f":"'Cable Parameters'!AA76","v":7.62},{"$f":"'Cable Parameters'!W76","v":2.2799999999999998},{"$f":"'Cable Parameters'!Z76","v":"Indoor Only"},{"$f":"'Cable Parameters'!Y76","v":"N/A"},{"$f":"IF(ISERROR('Cable Parameters'!X76),\"\",'Cable Parameters'!X76)","v":0},{"$f":"'Cable Parameters'!U76","v":"SiO2-090"}]
[null,{"$f":"'Cable Parameters'!AA77","v":11.43},{"$f":"'Cable Parameters'!W77","v":3.58},{"$f":"'Cable Parameters'!Z77","v":"Indoor Only"},{"$f":"'Cable Parameters'!Y77","v":"N/A"},{"$f":"IF(ISERROR('Cable Parameters'!X77),\"\",'Cable Parameters'!X77)","v":0},{"$f":"'Cable Parameters'!U77","v":"SiO2-141"}]
[null,{"$f":"'Cable Parameters'!AA78","v":17.78},{"$f":"'Cable Parameters'!W78","v":5.08},{"$f":"'Cable Parameters'!Z78","v":"Indoor Only"},{"$f":"'Cable Parameters'!Y78","v":"N/A"},{"$f":"IF(ISERROR('Cable Parameters'!X78),\"\",'Cable Parameters'!X78)","v":0},{"$f":"'Cable Parameters'!U78","v":"SiO2-200"}]
[null,{"$f":"'Cable Parameters'!AA79","v":25.4},{"$f":"'Cable Parameters'!W79","v":6.86},{"$f":"'Cable Parameters'!Z79","v":"Indoor Only"},{"$f":"'Cable Parameters'!Y79","v":"N/A"},{"$f":"IF(ISERROR('Cable Parameters'!X79),\"\",'Cable Parameters'!X79)","v":0},{"$f":"'Cable Parameters'!U79","v":"SiO2-270"}]
[null,{"$f":"'Cable Parameters'!AA80","v":127},{"$f":"'Cable Parameters'!W80","v":12},{"$f":"'Cable Parameters'!Z80","v":"In/Out door"},{"$f":"'Cable Parameters'!Y80","v":"N/A"},{"$f":"IF(ISERROR('Cable Parameters'!X80),\"\",'Cable Parameters'!X80)","v":0},{"$f":"'Cable Parameters'!U80","v":"QEAM 400"}]
[null,{"$f":"'Cable Parameters'!AA81","v":127},{"$f":"'Cable Parameters'!W81","v":12.7},{"$f":"'Cable Parameters'!Z81","v":"In/Out door"},{"$f":"'Cable Parameters'!Y81","v":"N/A"},{"$f":"IF(ISERROR('Cable Parameters'!X81),\"\",'Cable Parameters'!X81)","v":0},{"$f":"'Cable Parameters'!U81","v":"QEAM 500"}]
[null,{"$f":"'Cable Parameters'!AA82","v":203.2},{"$f":"'Cable Parameters'!W82","v":20.57},{"$f":"'Cable Parameters'!Z82","v":"In/Out door"},{"$f":"'Cable Parameters'!Y82","v":"N/A"},{"$f":"IF(ISERROR('Cable Parameters'!X82),\"\",'Cable Parameters'!X82)","v":0},{"$f":"'Cable Parameters'!U82","v":"QEAM 810"}]
[null,{"$f":"'Cable Parameters'!AA83","v":19.05},{"$f":"'Cable Parameters'!W83","v":4.57},{"$f":"'Cable Parameters'!Z83","v":"In/Out door"},{"$f":"'Cable Parameters'!Y83","v":"N/A"},{"$f":"IF(ISERROR('Cable Parameters'!X83),\"\",'Cable Parameters'!X83)","v":0},{"$f":"'Cable Parameters'!U83","v":"SFT 142"}]
[null,{"$f":"'Cable Parameters'!AA84","v":25.4},{"$f":"'Cable Parameters'!W84","v":5.2},{"$f":"'Cable Parameters'!Z84","v":"In/Out door"},{"$f":"'Cable Parameters'!Y84","v":"N/A"},{"$f":"IF(ISERROR('Cable Parameters'!X84),\"\",'Cable Parameters'!X84)","v":0},{"$f":"'Cable Parameters'!U84","v":"SFT 205"}]
[null,{"$f":"'Cable Parameters'!AA85","v":63.5},{"$f":"'Cable Parameters'!W85","v":12.3},{"$f":"'Cable Parameters'!Z85","v":"In/Out door"},{"$f":"'Cable Parameters'!Y85","v":"N/A"},{"$f":"IF(ISERROR('Cable Parameters'!X85),\"\",'Cable Parameters'!X85)","v":0},{"$f":"'Cable Parameters'!U85","v":"SFT 226"}]
[null,{"$f":"'Cable Parameters'!AA86","v":31.75},{"$f":"'Cable Parameters'!W86","v":6.35},{"$f":"'Cable Parameters'!Z86","v":"In/Out door"},{"$f":"'Cable Parameters'!Y86","v":"N/A"},{"$f":"IF(ISERROR('Cable Parameters'!X86),\"\",'Cable Parameters'!X86)","v":0},{"$f":"'Cable Parameters'!U86","v":"SFT 304"}]
[null,{"$f":"'Cable Parameters'!AA87","v":31.75},{"$f":"'Cable Parameters'!W87","v":6.5},{"$f":"'Cable Parameters'!Z87","v":"In/Out door"},{"$f":"'Cable Parameters'!Y87","v":"N/A"},{"$f":"IF(ISERROR('Cable Parameters'!X87),\"\",'Cable Parameters'!X87)","v":0},{"$f":"'Cable Parameters'!U87","v":"SFT 304 PUR"}]
[null,{"$f":"'Cable Parameters'!AA88","v":12.7},{"$f":"'Cable Parameters'!W88","v":3.05},{"$f":"'Cable Parameters'!Z88","v":"In/Out door"},{"$f":"'Cable Parameters'!Y88","v":"N/A"},{"$f":"IF(ISERROR('Cable Parameters'!X88),\"\",'Cable Parameters'!X88)","v":0},{"$f":"'Cable Parameters'!U88","v":"SFT 316"}]
[null,{"$f":"'Cable Parameters'!AA89","v":44.45},{"$f":"'Cable Parameters'!W89","v":7.39},{"$f":"'Cable Parameters'!Z89","v":"In/Out door"},{"$f":"'Cable Parameters'!Y89","v":"N/A"},{"$f":"IF(ISERROR('Cable Parameters'!X89),\"\",'Cable Parameters'!X89)","v":0},{"$f":"'Cable Parameters'!U89","v":"SFT 318"}]
[null,{"$f":"'Cable Parameters'!AA90","v":47.24},{"$f":"'Cable Parameters'!W90","v":8.18},{"$f":"'Cable Parameters'!Z90","v":"In/Out door"},{"$f":"'Cable Parameters'!Y90","v":"N/A"},{"$f":"IF(ISERROR('Cable Parameters'!X90),\"\",'Cable Parameters'!X90)","v":0},{"$f":"'Cable Parameters'!U90","v":"SFT 320"}]
[null,{"$f":"'Cable Parameters'!AA91","v":50.8},{"$f":"'Cable Parameters'!W91","v":9.91},{"$f":"'Cable Parameters'!Z91","v":"In/Out door"},{"$f":"'Cable Parameters'!Y91","v":"N/A"},{"$f":"IF(ISERROR('Cable Parameters'!X91),\"\",'Cable Parameters'!X91)","v":0},{"$f":"'Cable Parameters'!U91","v":"SFT 393"}]
[null,{"$f":"'Cable Parameters'!AA92","v":63.5},{"$f":"'Cable Parameters'!W92","v":12.45},{"$f":"'Cable Parameters'!Z92","v":"In/Out door"},{"$f":"'Cable Parameters'!Y92","v":"N/A"},{"$f":"IF(ISERROR('Cable Parameters'!X92),\"\",'Cable Parameters'!X92)","v":0},{"$f":"'Cable Parameters'!U92","v":"SFT 500"}]
[null,{"$f":"'Cable Parameters'!AA93","v":69.900000000000006},{"$f":"'Cable Parameters'!W93","v":14.35},{"$f":"'Cable Parameters'!Z93","v":"In/Out door"},{"$f":"'Cable Parameters'!Y93","v":"N/A"},{"$f":"IF(ISERROR('Cable Parameters'!X93),\"\",'Cable Parameters'!X93)","v":0},{"$f":"'Cable Parameters'!U93","v":"SFT 600"}]
[null,{"$f":"'Cable Parameters'!AA94","v":63.5},{"$f":"'Cable Parameters'!W94","v":14.22},{"$f":"'Cable Parameters'!Z94","v":"In/Out door"},{"$f":"'Cable Parameters'!Y94","v":"N/A"},{"$f":"IF(ISERROR('Cable Parameters'!X94),\"\",'Cable Parameters'!X94)","v":0},{"$f":"'Cable Parameters'!U94","v":"SFT-600-BCCAL"}]
[null,{"$f":"'Cable Parameters'!AA95","v":63.5},{"$f":"'Cable Parameters'!W95","v":14.22},{"$f":"'Cable Parameters'!Z95","v":"In/Out door"},{"$f":"'Cable Parameters'!Y95","v":"N/A"},{"$f":"IF(ISERROR('Cable Parameters'!X95),\"\",'Cable Parameters'!X95)","v":0},{"$f":"'Cable Parameters'!U95","v":"SFT-600-BCCAL-PUR"}]
[null,{"$f":"'Cable Parameters'!AA96","v":101.6},{"$f":"'Cable Parameters'!W96","v":10.199999999999999},{"$f":"'Cable Parameters'!Z96","v":"In/Out door"},{"$f":"'Cable Parameters'!Y96","v":"N/A"},{"$f":"IF(ISERROR('Cable Parameters'!X96),\"\",'Cable Parameters'!X96)","v":0},{"$f":"'Cable Parameters'!U96","v":"TCOM 400-UF"}]
[null,{"$f":"'Cable Parameters'!AA97","v":101.6},{"$f":"'Cable Parameters'!W97","v":10},{"$f":"'Cable Parameters'!Z97","v":"In/Out door"},{"$f":"'Cable Parameters'!Y97","v":"N/A"},{"$f":"IF(ISERROR('Cable Parameters'!X97),\"\",'Cable Parameters'!X97)","v":0},{"$f":"'Cable Parameters'!U97","v":"TCOM 400-FS"}]
[null,{"$f":"'Cable Parameters'!AA98","v":152.4},{"$f":"'Cable Parameters'!W98","v":15},{"$f":"'Cable Parameters'!Z98","v":"In/Out door"},{"$f":"'Cable Parameters'!Y98","v":"N/A"},{"$f":"IF(ISERROR('Cable Parameters'!X98),\"\",'Cable Parameters'!X98)","v":0},{"$f":"'Cable Parameters'!U98","v":"TCOM 600-UF"}]
[null,{"$f":"'Cable Parameters'!AA99","v":152.4},{"$f":"'Cable Parameters'!W99","v":15},{"$f":"'Cable Parameters'!Z99","v":"In/Out door"},{"$f":"'Cable Parameters'!Y99","v":"N/A"},{"$f":"IF(ISERROR('Cable Parameters'!X99),\"\",'Cable Parameters'!X99)","v":0},{"$f":"'Cable Parameters'!U99","v":"TCOM 600-FS"}]
[null,{"$f":"'Cable Parameters'!AA100","v":28.574999999999999},{"$f":"'Cable Parameters'!W100","v":6.9},{"$f":"'Cable Parameters'!Z100","v":"Indoor Only"},{"$f":"'Cable Parameters'!Y100","v":"N/A"},{"$f":"IF(ISERROR('Cable Parameters'!X100),\"\",'Cable Parameters'!X100)","v":0},{"$f":"'Cable Parameters'!U100","v":"TFlex 401"}]
[null,{"$f":"'Cable Parameters'!AA101","v":12.7},{"$f":"'Cable Parameters'!W101","v":4.0599999999999996},{"$f":"'Cable Parameters'!Z101","v":"Indoor Only"},{"$f":"'Cable Parameters'!Y101","v":"N/A"},{"$f":"IF(ISERROR('Cable Parameters'!X101),\"\",'Cable Parameters'!X101)","v":0},{"$f":"'Cable Parameters'!U101","v":"TFlex 402"}]
[null,{"$f":"'Cable Parameters'!AA102","v":6.35},{"$f":"'Cable Parameters'!W102","v":2.64},{"$f":"'Cable Parameters'!Z102","v":"Indoor Only"},{"$f":"'Cable Parameters'!Y102","v":"N/A"},{"$f":"IF(ISERROR('Cable Parameters'!X102),\"\",'Cable Parameters'!X102)","v":0},{"$f":"'Cable Parameters'!U102","v":"TFlex 405"}]
[null,{"$f":"'Cable Parameters'!AA103","v":22.22},{"$f":"'Cable Parameters'!W103","v":4.4000000000000004},{"$f":"'Cable Parameters'!Z103","v":"In/Out door"},{"$f":"'Cable Parameters'!Y103","v":"N/A"},{"$f":"IF(ISERROR('Cable Parameters'!X103),\"\",'Cable Parameters'!X103)","v":0},{"$f":"'Cable Parameters'!U103","v":"FBT 195"}]
[null,{"$f":"'Cable Parameters'!AA104","v":22.22},{"$f":"'Cable Parameters'!W104","v":4.4000000000000004},{"$f":"'Cable Parameters'!Z104","v":"In/Out door"},{"$f":"'Cable Parameters'!Y104","v":"N/A"},{"$f":"IF(ISERROR('Cable Parameters'!X104),\"\",'Cable Parameters'!X104)","v":0},{"$f":"'Cable Parameters'!U104","v":"FBT 200"}]
[null,{"$f":"'Cable Parameters'!AA105","v":25.4},{"$f":"'Cable Parameters'!W105","v":5.2},{"$f":"'Cable Parameters'!Z105","v":"In/Out door"},{"$f":"'Cable Parameters'!Y105","v":"N/A"},{"$f":"IF(ISERROR('Cable Parameters'!X105),\"\",'Cable Parameters'!X105)","v":0},{"$f":"'Cable Parameters'!U105","v":"FBT 240"}]
[null,{"$f":"'Cable Parameters'!AA106","v":31.75},{"$f":"'Cable Parameters'!W106","v":6.6},{"$f":"'Cable Parameters'!Z106","v":"In/Out door"},{"$f":"'Cable Parameters'!Y106","v":"N/A"},{"$f":"IF(ISERROR('Cable Parameters'!X106),\"\",'Cable Parameters'!X106)","v":0},{"$f":"'Cable Parameters'!U106","v":"FBT 300"}]
[null,{"$f":"'Cable Parameters'!AA107","v":44.45},{"$f":"'Cable Parameters'!W107","v":9.4},{"$f":"'Cable Parameters'!Z107","v":"In/Out door"},{"$f":"'Cable Parameters'!Y107","v":"N/A"},{"$f":"IF(ISERROR('Cable Parameters'!X107),\"\",'Cable Parameters'!X107)","v":0},{"$f":"'Cable Parameters'!U107","v":"FBT 400"}]
[null,{"$f":"'Cable Parameters'!AA108","v":57.15},{"$f":"'Cable Parameters'!W108","v":11.8},{"$f":"'Cable Parameters'!Z108","v":"In/Out door"},{"$f":"'Cable Parameters'!Y108","v":"N/A"},{"$f":"IF(ISERROR('Cable Parameters'!X108),\"\",'Cable Parameters'!X108)","v":0},{"$f":"'Cable Parameters'!U108","v":"FBT 500"}]
[null,{"$f":"'Cable Parameters'!AA109","v":69.849999999999994},{"$f":"'Cable Parameters'!W109","v":14.35},{"$f":"'Cable Parameters'!Z109","v":"In/Out door"},{"$f":"'Cable Parameters'!Y109","v":"N/A"},{"$f":"IF(ISERROR('Cable Parameters'!X109),\"\",'Cable Parameters'!X109)","v":0},{"$f":"'Cable Parameters'!U109","v":"FBT 600"}]
[null,{"$f":"'Cable Parameters'!AA110","v":"N/A"},{"$f":"'Cable Parameters'!W110","v":8.43},{"$f":"'Cable Parameters'!Z110","v":"Indoor Only"},{"$f":"'Cable Parameters'!Y110","v":"N/A"},{"$f":"IF(ISERROR('Cable Parameters'!X110),\"\",'Cable Parameters'!X110)","v":0},{"$f":"'Cable Parameters'!U110","v":"M17/180 (LSRG-6)"}]
[null,{"$f":"'Cable Parameters'!AA111","v":"N/A"},{"$f":"'Cable Parameters'!W111","v":10.29},{"$f":"'Cable Parameters'!Z111","v":"Indoor Only"},{"$f":"'Cable Parameters'!Y111","v":"N/A"},{"$f":"IF(ISERROR('Cable Parameters'!X111),\"\",'Cable Parameters'!X111)","v":0},{"$f":"'Cable Parameters'!U111","v":"M17/181 (LSRG-11)"}]
[null,{"$f":"'Cable Parameters'!AA112","v":30},{"$f":"'Cable Parameters'!W112","v":4.95},{"$f":"'Cable Parameters'!Z112","v":"Indoor Only"},{"$f":"'Cable Parameters'!Y112","v":"N/A"},{"$f":"IF(ISERROR('Cable Parameters'!X112),\"\",'Cable Parameters'!X112)","v":0},{"$f":"'Cable Parameters'!U112","v":"M17/183 (LSRG-58)"}]
[null,{"$f":"'Cable Parameters'!AA113","v":55},{"$f":"'Cable Parameters'!W113","v":10.8},{"$f":"'Cable Parameters'!Z113","v":"Indoor Only"},{"$f":"'Cable Parameters'!Y113","v":"N/A"},{"$f":"IF(ISERROR('Cable Parameters'!X113),\"\",'Cable Parameters'!X113)","v":0},{"$f":"'Cable Parameters'!U113","v":"M17/190 (LSRG-214)"}]
[null,{"$f":"'Cable Parameters'!AA114","v":30},{"$f":"'Cable Parameters'!W114","v":5.38},{"$f":"'Cable Parameters'!Z114","v":"Indoor Only"},{"$f":"'Cable Parameters'!Y114","v":"N/A"},{"$f":"IF(ISERROR('Cable Parameters'!X114),\"\",'Cable Parameters'!X114)","v":0},{"$f":"'Cable Parameters'!U114","v":"M17/194 (LSRG-223)"}]
[null,{"$f":"'Cable Parameters'!AA115","v":25.4},{"$f":"'Cable Parameters'!W115","v":4.95},{"$f":"'Cable Parameters'!Z115","v":"Indoor Only"},{"$f":"'Cable Parameters'!Y115","v":"N/A"},{"$f":"IF(ISERROR('Cable Parameters'!X115),\"\",'Cable Parameters'!X115)","v":0},{"$f":"'Cable Parameters'!U115","v":"M17/220 (LLSB-200)"}]
[null,{"$f":"'Cable Parameters'!AA116","v":31.8},{"$f":"'Cable Parameters'!W116","v":6.15},{"$f":"'Cable Parameters'!Z116","v":"Indoor Only"},{"$f":"'Cable Parameters'!Y116","v":"N/A"},{"$f":"IF(ISERROR('Cable Parameters'!X116),\"\",'Cable Parameters'!X116)","v":0},{"$f":"'Cable Parameters'!U116","v":"M17/221 (LLSB-240)"}]
[null,{"$f":"'Cable Parameters'!AA117","v":50.8},{"$f":"'Cable Parameters'!W117","v":10.29},{"$f":"'Cable Parameters'!Z117","v":"Indoor Only"},{"$f":"'Cable Parameters'!Y117","v":"N/A"},{"$f":"IF(ISERROR('Cable Parameters'!X117),\"\",'Cable Parameters'!X117)","v":0},{"$f":"'Cable Parameters'!U117","v":"M17/223 (LLSB-400)"}]
[null,{"$f":"'Cable Parameters'!AA118","v":76.2},{"$f":"'Cable Parameters'!W118","v":14.99},{"$f":"'Cable Parameters'!Z118","v":"Indoor Only"},{"$f":"'Cable Parameters'!Y118","v":"N/A"},{"$f":"IF(ISERROR('Cable Parameters'!X118),\"\",'Cable Parameters'!X118)","v":0},{"$f":"'Cable Parameters'!U118","v":"M17/225 (LLSB-600)"}]
[null,{"$f":"'Cable Parameters'!AA119","v":114.3},{"$f":"'Cable Parameters'!W119","v":22.1},{"$f":"'Cable Parameters'!Z119","v":"Indoor Only"},{"$f":"'Cable Parameters'!Y119","v":"N/A"},{"$f":"IF(ISERROR('Cable Parameters'!X119),\"\",'Cable Parameters'!X119)","v":0},{"$f":"'Cable Parameters'!U119","v":"M17/226 (LLSB-900)"}]
[null,{"$f":"'Cable Parameters'!AA120","v":152.4},{"$f":"'Cable Parameters'!W120","v":30.48},{"$f":"'Cable Parameters'!Z120","v":"Indoor Only"},{"$f":"'Cable Parameters'!Y120","v":"N/A"},{"$f":"IF(ISERROR('Cable Parameters'!X120),\"\",'Cable Parameters'!X120)","v":0},{"$f":"'Cable Parameters'!U120","v":"M17/227 (LLSB-1200)"}]
[null,{"$f":"'Cable Parameters'!AA121","v":12.7},{"$f":"'Cable Parameters'!W121","v":4.95},{"$f":"'Cable Parameters'!Z121","v":"In/Out door"},{"$f":"'Cable Parameters'!Y121","v":"N/A"},{"$f":"IF(ISERROR('Cable Parameters'!X121),\"\",'Cable Parameters'!X121)","v":0},{"$f":"'Cable Parameters'!U121","v":"TCOM-200-LS"}]
[null,{"$f":"'Cable Parameters'!AA122","v":19.100000000000001},{"$f":"'Cable Parameters'!W122","v":6.1},{"$f":"'Cable Parameters'!Z122","v":"In/Out door"},{"$f":"'Cable Parameters'!Y122","v":"N/A"},{"$f":"IF(ISERROR('Cable Parameters'!X122),\"\",'Cable Parameters'!X122)","v":0},{"$f":"'Cable Parameters'!U122","v":"TCOM-240-LS"}]
[null,{"$f":"'Cable Parameters'!AA123","v":22.2},{"$f":"'Cable Parameters'!W123","v":7.62},{"$f":"'Cable Parameters'!Z123","v":"In/Out door"},{"$f":"'Cable Parameters'!Y123","v":"N/A"},{"$f":"IF(ISERROR('Cable Parameters'!X123),\"\",'Cable Parameters'!X123)","v":0},{"$f":"'Cable Parameters'!U123","v":"TCOM-300-LS"}]
[null,{"$f":"'Cable Parameters'!AA124","v":25.4},{"$f":"'Cable Parameters'!W124","v":10.29},{"$f":"'Cable Parameters'!Z124","v":"In/Out door"},{"$f":"'Cable Parameters'!Y124","v":"N/A"},{"$f":"IF(ISERROR('Cable Parameters'!X124),\"\",'Cable Parameters'!X124)","v":0},{"$f":"'Cable Parameters'!U124","v":"TCOM-400-LS"}]
[null,{"$f":"'Cable Parameters'!AA125","v":31.8},{"$f":"'Cable Parameters'!W125","v":12.7},{"$f":"'Cable Parameters'!Z125","v":"In/Out door"},{"$f":"'Cable Parameters'!Y125","v":"N/A"},{"$f":"IF(ISERROR('Cable Parameters'!X125),\"\",'Cable Parameters'!X125)","v":0},{"$f":"'Cable Parameters'!U125","v":"TCOM-500-LS"}]
[null,{"$f":"'Cable Parameters'!AA126","v":38.1},{"$f":"'Cable Parameters'!W126","v":14.99},{"$f":"'Cable Parameters'!Z126","v":"In/Out door"},{"$f":"'Cable Parameters'!Y126","v":"N/A"},{"$f":"IF(ISERROR('Cable Parameters'!X126),\"\",'Cable Parameters'!X126)","v":0},{"$f":"'Cable Parameters'!U126","v":"TCOM-600-LS "}]
[null,{"$f":"'Cable Parameters'!AA127","v":19.05},{"$f":"'Cable Parameters'!W127","v":3.3},{"$f":"'Cable Parameters'!Z127","v":"In/Out door"},{"$f":"'Cable Parameters'!Y127","v":"N/A"},{"$f":"IF(ISERROR('Cable Parameters'!X127),\"\",'Cable Parameters'!X127)","v":0},{"$f":"'Cable Parameters'!U127","v":"SPFLT 130"}]
[null,{"$f":"'Cable Parameters'!AA128","v":25.4},{"$f":"'Cable Parameters'!W128","v":5.0999999999999996},{"$f":"'Cable Parameters'!Z128","v":"In/Out door"},{"$f":"'Cable Parameters'!Y128","v":"N/A"},{"$f":"IF(ISERROR('Cable Parameters'!X128),\"\",'Cable Parameters'!X128)","v":0},{"$f":"'Cable Parameters'!U128","v":"SPFLT 200"}]
[null,{"$f":"'Cable Parameters'!AA129","v":38.1},{"$f":"'Cable Parameters'!W129","v":7.8},{"$f":"'Cable Parameters'!Z129","v":"In/Out door"},{"$f":"'Cable Parameters'!Y129","v":"N/A"},{"$f":"IF(ISERROR('Cable Parameters'!X129),\"\",'Cable Parameters'!X129)","v":0},{"$f":"'Cable Parameters'!U129","v":"SPFLT 305"}]
[null,{"$f":"'Cable Parameters'!AA130","v":50.8},{"$f":"'Cable Parameters'!W130","v":9.91},{"$f":"'Cable Parameters'!Z130","v":"In/Out door"},{"$f":"'Cable Parameters'!Y130","v":"N/A"},{"$f":"IF(ISERROR('Cable Parameters'!X130),\"\",'Cable Parameters'!X130)","v":0},{"$f":"'Cable Parameters'!U130","v":"HP-393"}]
[null,{"$f":"'Cable Parameters'!AA131","v":127},{"$f":"'Cable Parameters'!W131","v":12.32},{"$f":"'Cable Parameters'!Z131","v":"In/Out door"},{"$f":"'Cable Parameters'!Y131","v":"N/A"},{"$f":"IF(ISERROR('Cable Parameters'!X131),\"\",'Cable Parameters'!X131)","v":0},{"$f":"'Cable Parameters'!U131","v":"HP-226"}]
[null,{"$f":"'Cable Parameters'!AA132","v":69.900000000000006},{"$f":"'Cable Parameters'!W132","v":14.99},{"$f":"'Cable Parameters'!Z132","v":"In/Out door"},{"$f":"'Cable Parameters'!Y132","v":"N/A"},{"$f":"IF(ISERROR('Cable Parameters'!X132),\"\",'Cable Parameters'!X132)","v":0},{"$f":"'Cable Parameters'!U132","v":"HP-600A"}]
[null,{"$f":"'Cable Parameters'!AA133","v":203},{"$f":"'Cable Parameters'!W133","v":19.940000000000001},{"$f":"'Cable Parameters'!Z133","v":"In/Out door"},{"$f":"'Cable Parameters'!Y133","v":"N/A"},{"$f":"IF(ISERROR('Cable Parameters'!X133),\"\",'Cable Parameters'!X133)","v":0},{"$f":"'Cable Parameters'!U133","v":"HP-218"}]
[null,{"$f":"'Cable Parameters'!AA134","v":101.6},{"$f":"'Cable Parameters'!W134","v":19.690000000000001},{"$f":"'Cable Parameters'!Z134","v":"In/Out door"},{"$f":"'Cable Parameters'!Y134","v":"N/A"},{"$f":"IF(ISERROR('Cable Parameters'!X134),\"\",'Cable Parameters'!X134)","v":0},{"$f":"'Cable Parameters'!U134","v":"HP-900"}]
[null,{"$f":"'Cable Parameters'!AA135","v":203.2},{"$f":"'Cable Parameters'!W135","v":26.67},{"$f":"'Cable Parameters'!Z135","v":"In/Out door"},{"$f":"'Cable Parameters'!Y135","v":"N/A"},{"$f":"IF(ISERROR('Cable Parameters'!X135),\"\",'Cable Parameters'!X135)","v":0},{"$f":"'Cable Parameters'!U135","v":"HP-1200"}]
[null,{"$f":"'Cable Parameters'!AA136","v":57.2},{"$f":"'Cable Parameters'!W136","v":10.92},{"$f":"'Cable Parameters'!Z136","v":"In/Out door"},{"$f":"'Cable Parameters'!Y136","v":"N/A"},{"$f":"IF(ISERROR('Cable Parameters'!X136),\"\",'Cable Parameters'!X136)","v":0},{"$f":"'Cable Parameters'!U136","v":"HPL-393"}]
[null,{"$f":"'Cable Parameters'!AA137","v":69.900000000000006},{"$f":"'Cable Parameters'!W137","v":13.08},{"$f":"'Cable Parameters'!Z137","v":"In/Out door"},{"$f":"'Cable Parameters'!Y137","v":"N/A"},{"$f":"IF(ISERROR('Cable Parameters'!X137),\"\",'Cable Parameters'!X137)","v":0},{"$f":"'Cable Parameters'!U137","v":"HPL-226"}]
[null,{"$f":"'Cable Parameters'!AA138","v":76.2},{"$f":"'Cable Parameters'!W138","v":15.49},{"$f":"'Cable Parameters'!Z138","v":"In/Out door"},{"$f":"'Cable Parameters'!Y138","v":"N/A"},{"$f":"IF(ISERROR('Cable Parameters'!X138),\"\",'Cable Parameters'!X138)","v":0},{"$f":"'Cable Parameters'!U138","v":"HPL-600"}]
[null,{"$f":"'Cable Parameters'!AA139","v":108},{"$f":"'Cable Parameters'!W139","v":21.46},{"$f":"'Cable Parameters'!Z139","v":"In/Out door"},{"$f":"'Cable Parameters'!Y139","v":"N/A"},{"$f":"IF(ISERROR('Cable Parameters'!X139),\"\",'Cable Parameters'!X139)","v":0},{"$f":"'Cable Parameters'!U139","v":"HPL-218"}]
[null,{"$f":"'Cable Parameters'!AA140","v":228.6},{"$f":"'Cable Parameters'!W140","v":30.48},{"$f":"'Cable Parameters'!Z140","v":"In/Out door"},{"$f":"'Cable Parameters'!Y140","v":"N/A"},{"$f":"IF(ISERROR('Cable Parameters'!X140),\"\",'Cable Parameters'!X140)","v":0},{"$f":"'Cable Parameters'!U140","v":"HPL-1200"}]
[null,{"$f":"'Cable Parameters'!AA141","v":177.8},{"$f":"'Cable Parameters'!W141","v":30.48},{"$f":"'Cable Parameters'!Z141","v":"In/Out door"},{"$f":"'Cable Parameters'!Y141","v":"N/A"},{"$f":"IF(ISERROR('Cable Parameters'!X141),\"\",'Cable Parameters'!X141)","v":0},{"$f":"'Cable Parameters'!U141","v":"HP-1200-PUR"}]
[null,{"$f":"'Cable Parameters'!AA142","v":38.1},{"$f":"'Cable Parameters'!W142","v":4.32},{"$f":"'Cable Parameters'!Z142","v":"Indoor Only"},{"$f":"'Cable Parameters'!Y142","v":"N/A"},{"$f":"IF(ISERROR('Cable Parameters'!X142),\"\",'Cable Parameters'!X142)","v":0},{"$f":"'Cable Parameters'!U142","v":"HFlex-142"}]
[null,{"$f":"'Cable Parameters'!AA143","v":12.7},{"$f":"'Cable Parameters'!W143","v":2.79},{"$f":"'Cable Parameters'!Z143","v":"In/Out door"},{"$f":"'Cable Parameters'!Y143","v":"N/A"},{"$f":"IF(ISERROR('Cable Parameters'!X143),\"\",'Cable Parameters'!X143)","v":0},{"$f":"'Cable Parameters'!U143","v":"SF- 316"}]
[null,{"$f":"'Cable Parameters'!AA144","v":25.4},{"$f":"'Cable Parameters'!W144","v":4.95},{"$f":"'Cable Parameters'!Z144","v":"In/Out door"},{"$f":"'Cable Parameters'!Y144","v":"N/A"},{"$f":"IF(ISERROR('Cable Parameters'!X144),\"\",'Cable Parameters'!X144)","v":0},{"$f":"'Cable Parameters'!U144","v":"SF- 142"}]
[null,{"$f":"'Cable Parameters'!AA145","v":38.1},{"$f":"'Cable Parameters'!W145","v":7.37},{"$f":"'Cable Parameters'!Z145","v":"In/Out door"},{"$f":"'Cable Parameters'!Y145","v":"N/A"},{"$f":"IF(ISERROR('Cable Parameters'!X145),\"\",'Cable Parameters'!X145)","v":0},{"$f":"'Cable Parameters'!U145","v":"SF- 304"}]
[null,{"$f":"'Cable Parameters'!AA146","v":50.8},{"$f":"'Cable Parameters'!W146","v":10.8},{"$f":"'Cable Parameters'!Z146","v":"In/Out door"},{"$f":"'Cable Parameters'!Y146","v":"N/A"},{"$f":"IF(ISERROR('Cable Parameters'!X146),\"\",'Cable Parameters'!X146)","v":0},{"$f":"'Cable Parameters'!U146","v":"SF- 214"}]
[null,{"$f":"'Cable Parameters'!AA147","v":50.8},{"$f":"'Cable Parameters'!W147","v":9.91},{"$f":"'Cable Parameters'!Z147","v":"In/Out door"},{"$f":"'Cable Parameters'!Y147","v":"N/A"},{"$f":"IF(ISERROR('Cable Parameters'!X147),\"\",'Cable Parameters'!X147)","v":0},{"$f":"'Cable Parameters'!U147","v":"SF- 393"}]
[null,{"$f":"'Cable Parameters'!AA148","v":12.7},{"$f":"'Cable Parameters'!W148","v":4.95},{"$f":"'Cable Parameters'!Z148","v":"In/Out door"},{"$f":"'Cable Parameters'!Y148","v":"N/A"},{"$f":"IF(ISERROR('Cable Parameters'!X148),\"\",'Cable Parameters'!X148)","v":0},{"$f":"'Cable Parameters'!U148","v":"TCOM-195"}]
[null,{"$f":"'Cable Parameters'!AA149","v":12.7},{"$f":"'Cable Parameters'!W149","v":4.95},{"$f":"'Cable Parameters'!Z149","v":"In/Out door"},{"$f":"'Cable Parameters'!Y149","v":"N/A"},{"$f":"IF(ISERROR('Cable Parameters'!X149),\"\",'Cable Parameters'!X149)","v":0},{"$f":"'Cable Parameters'!U149","v":"TCOM-200"}]
[null,{"$f":"'Cable Parameters'!AA150","v":19.100000000000001},{"$f":"'Cable Parameters'!W150","v":6.1},{"$f":"'Cable Parameters'!Z150","v":"In/Out door"},{"$f":"'Cable Parameters'!Y150","v":"N/A"},{"$f":"IF(ISERROR('Cable Parameters'!X150),\"\",'Cable Parameters'!X150)","v":0},{"$f":"'Cable Parameters'!U150","v":"TCOM-240"}]
[null,{"$f":"'Cable Parameters'!AA151","v":22.2},{"$f":"'Cable Parameters'!W151","v":7.62},{"$f":"'Cable Parameters'!Z151","v":"In/Out door"},{"$f":"'Cable Parameters'!Y151","v":"N/A"},{"$f":"IF(ISERROR('Cable Parameters'!X151),\"\",'Cable Parameters'!X151)","v":0},{"$f":"'Cable Parameters'!U151","v":"TCOM-300"}]
[null,{"$f":"'Cable Parameters'!AA152","v":25.4},{"$f":"'Cable Parameters'!W152","v":10.29},{"$f":"'Cable Parameters'!Z152","v":"In/Out door"},{"$f":"'Cable Parameters'!Y152","v":"N/A"},{"$f":"IF(ISERROR('Cable Parameters'!X152),\"\",'Cable Parameters'!X152)","v":0},{"$f":"'Cable Parameters'!U152","v":"TCOM-400"}]
[null,{"$f":"'Cable Parameters'!AA153","v":31.8},{"$f":"'Cable Parameters'!W153","v":12.7},{"$f":"'Cable Parameters'!Z153","v":"In/Out door"},{"$f":"'Cable Parameters'!Y153","v":"N/A"},{"$f":"IF(ISERROR('Cable Parameters'!X153),\"\",'Cable Parameters'!X153)","v":0},{"$f":"'Cable Parameters'!U153","v":"TCOM-500"}]
[null,{"$f":"'Cable Parameters'!AA154","v":38.1},{"$f":"'Cable Parameters'!W154","v":14.99},{"$f":"'Cable Parameters'!Z154","v":"In/Out door"},{"$f":"'Cable Parameters'!Y154","v":"N/A"},{"$f":"IF(ISERROR('Cable Parameters'!X154),\"\",'Cable Parameters'!X154)","v":0},{"$f":"'Cable Parameters'!U154","v":"TCOM-600"}]
[null,{"$f":"'Cable Parameters'!AA155","v":49.55},{"$f":"'Cable Parameters'!W155","v":9.91},{"$f":"'Cable Parameters'!Z155","v":"Indoor Only"},{"$f":"'Cable Parameters'!Y155","v":"N/A"},{"$f":"IF(ISERROR('Cable Parameters'!X155),\"\",'Cable Parameters'!X155)","v":0},{"$f":"'Cable Parameters'!U155","v":"M17/127-RG 393"}]
[null,{"$f":"'Cable Parameters'!AA156","v":69.2},{"$f":"'Cable Parameters'!W156","v":13.84},{"$f":"'Cable Parameters'!Z156","v":"Indoor Only"},{"$f":"'Cable Parameters'!Y156","v":"N/A"},{"$f":"IF(ISERROR('Cable Parameters'!X156),\"\",'Cable Parameters'!X156)","v":0},{"$f":"'Cable Parameters'!U156","v":"M17/78-RG 217"}]
[null,{"$f":"'Cable Parameters'!AA157","v":113.65},{"$f":"'Cable Parameters'!W157","v":22.73},{"$f":"'Cable Parameters'!Z157","v":"Indoor Only"},{"$f":"'Cable Parameters'!Y157","v":"N/A"},{"$f":"IF(ISERROR('Cable Parameters'!X157),\"\",'Cable Parameters'!X157)","v":0},{"$f":"'Cable Parameters'!U157","v":"M17/67-RG 177"}]
[null,{"$f":"'Cable Parameters'!AA158","v":110.5},{"$f":"'Cable Parameters'!W158","v":22.1},{"$f":"'Cable Parameters'!Z158","v":"Indoor Only"},{"$f":"'Cable Parameters'!Y158","v":"N/A"},{"$f":"IF(ISERROR('Cable Parameters'!X158),\"\",'Cable Parameters'!X158)","v":0},{"$f":"'Cable Parameters'!U158","v":"M17/79-RG 218"}]
[null,{"$f":"'Cable Parameters'!AA159","v":24.75},{"$f":"'Cable Parameters'!W159","v":4.95},{"$f":"'Cable Parameters'!Z159","v":"Indoor Only"},{"$f":"'Cable Parameters'!Y159","v":"N/A"},{"$f":"IF(ISERROR('Cable Parameters'!X159),\"\",'Cable Parameters'!X159)","v":0},{"$f":"'Cable Parameters'!U159","v":"M17/28-RG 58"}]
[null,{"$f":"'Cable Parameters'!AA160","v":38},{"$f":"'Cable Parameters'!W160","v":8.89},{"$f":"'Cable Parameters'!Z160","v":"In/Out door"},{"$f":"'Cable Parameters'!Y160","v":"N/A"},{"$f":"IF(ISERROR('Cable Parameters'!X160),\"\",'Cable Parameters'!X160)","v":0},{"$f":"'Cable Parameters'!U160","v":"T-RAD™-400"}]
[null,{"$f":"'Cable Parameters'!AA161","v":38},{"$f":"'Cable Parameters'!W161","v":13.46},{"$f":"'Cable Parameters'!Z161","v":"In/Out door"},{"$f":"'Cable Parameters'!Y161","v":"N/A"},{"$f":"IF(ISERROR('Cable Parameters'!X161),\"\",'Cable Parameters'!X161)","v":0},{"$f":"'Cable Parameters'!U161","v":"T-RAD™-600"}]
[null,{"$f":"'Cable Parameters'!AA162","v":76.2},{"$f":"'Cable Parameters'!W162","v":22.1},{"$f":"'Cable Parameters'!Z162","v":"In/Out door"},{"$f":"'Cable Parameters'!Y162","v":"N/A"},{"$f":"IF(ISERROR('Cable Parameters'!X162),\"\",'Cable Parameters'!X162)","v":0},{"$f":"'Cable Parameters'!U162","v":"T-RAD™-900"}]
[null,{"$f":"'Cable Parameters'!AA163","v":165},{"$f":"'Cable Parameters'!W163","v":30.5},{"$f":"'Cable Parameters'!Z163","v":"In/Out door"},{"$f":"'Cable Parameters'!Y163","v":"N/A"},{"$f":"IF(ISERROR('Cable Parameters'!X163),\"\",'Cable Parameters'!X163)","v":0},{"$f":"'Cable Parameters'!U163","v":"nu-TRAC® TRC-875"}]
[null,{"$f":"'Cable Parameters'!AA164","v":342},{"$f":"'Cable Parameters'!W164","v":42.4},{"$f":"'Cable Parameters'!Z164","v":"In/Out door"},{"$f":"'Cable Parameters'!Y164","v":"N/A"},{"$f":"IF(ISERROR('Cable Parameters'!X164),\"\",'Cable Parameters'!X164)","v":0},{"$f":"'Cable Parameters'!U164","v":"nu-TRAC® TRC-1250"}]
[null,{"$f":"'Cable Parameters'!AA165","v":25},{"$f":"'Cable Parameters'!W165","v":7.7},{"$f":"'Cable Parameters'!Z165","v":"In/Out door"},{"$f":"'Cable Parameters'!Y165","v":"N/A"},{"$f":"IF(ISERROR('Cable Parameters'!X165),\"\",'Cable Parameters'!X165)","v":0},{"$f":"'Cable Parameters'!U165","v":"SPO-250"}]
[null,{"$f":"'Cable Parameters'!AA166","v":2.2999999999999998},{"$f":"'Cable Parameters'!W166","v":10.8},{"$f":"'Cable Parameters'!Z166","v":"In/Out door"},{"$f":"'Cable Parameters'!Y166","v":"N/A"},{"$f":"IF(ISERROR('Cable Parameters'!X166),\"\",'Cable Parameters'!X166)","v":0},{"$f":"'Cable Parameters'!U166","v":"SPO-375"}]
[null,{"$f":"'Cable Parameters'!AA167","v":51},{"$f":"'Cable Parameters'!W167","v":13.4},{"$f":"'Cable Parameters'!Z167","v":"In/Out door"},{"$f":"'Cable Parameters'!Y167","v":"N/A"},{"$f":"IF(ISERROR('Cable Parameters'!X167),\"\",'Cable Parameters'!X167)","v":0},{"$f":"'Cable Parameters'!U167","v":"SPO-500"}]
[null,{"$f":"'Cable Parameters'!AA168","v":25},{"$f":"'Cable Parameters'!W168","v":7.7},{"$f":"'Cable Parameters'!Z168","v":"Indoor Only"},{"$f":"'Cable Parameters'!Y168","v":"N/A"},{"$f":"IF(ISERROR('Cable Parameters'!X168),\"\",'Cable Parameters'!X168)","v":0},{"$f":"'Cable Parameters'!U168","v":"SPF-250"}]
[null,{"$f":"'Cable Parameters'!AA169","v":2.2999999999999998},{"$f":"'Cable Parameters'!W169","v":10.8},{"$f":"'Cable Parameters'!Z169","v":"Indoor Only"},{"$f":"'Cable Parameters'!Y169","v":"N/A"},{"$f":"IF(ISERROR('Cable Parameters'!X169),\"\",'Cable Parameters'!X169)","v":0},{"$f":"'Cable Parameters'!U169","v":"SPF-375"}]
[null,{"$f":"'Cable Parameters'!AA170","v":51},{"$f":"'Cable Parameters'!W170","v":13.4},{"$f":"'Cable Parameters'!Z170","v":"Indoor Only"},{"$f":"'Cable Parameters'!Y170","v":"N/A"},{"$f":"IF(ISERROR('Cable Parameters'!X170),\"\",'Cable Parameters'!X170)","v":0},{"$f":"'Cable Parameters'!U170","v":"SPF-500"}]
[null,{"$f":"'Cable Parameters'!AA171","v":32},{"$f":"'Cable Parameters'!W171","v":7.1},{"$f":"'Cable Parameters'!Z171","v":"In/Out door"},{"$f":"'Cable Parameters'!Y171","v":"N/A"},{"$f":"IF(ISERROR('Cable Parameters'!X171),\"\",'Cable Parameters'!X171)","v":0},{"$f":"'Cable Parameters'!U171","v":"SPP-250-LLPL"}]
[null,{"$f":"'Cable Parameters'!AA172","v":35},{"$f":"'Cable Parameters'!W172","v":10.199999999999999},{"$f":"'Cable Parameters'!Z172","v":"In/Out door"},{"$f":"'Cable Parameters'!Y172","v":"N/A"},{"$f":"IF(ISERROR('Cable Parameters'!X172),\"\",'Cable Parameters'!X172)","v":0},{"$f":"'Cable Parameters'!U172","v":"SPP-375-LLPL"}]
[null,{"$f":"'Cable Parameters'!AA173","v":38},{"$f":"'Cable Parameters'!W173","v":13.4},{"$f":"'Cable Parameters'!Z173","v":"In/Out door"},{"$f":"'Cable Parameters'!Y173","v":"N/A"},{"$f":"IF(ISERROR('Cable Parameters'!X173),\"\",'Cable Parameters'!X173)","v":0},{"$f":"'Cable Parameters'!U173","v":"SPP-500-LLPL"}]
[null,{"$f":"'Cable Parameters'!AA174","v":19.05},{"$f":"'Cable Parameters'!W174","v":6.73},{"$f":"'Cable Parameters'!Z174","v":"In/Out door"},{"$f":"'Cable Parameters'!Y174","v":"N/A"},{"$f":"IF(ISERROR('Cable Parameters'!X174),\"\",'Cable Parameters'!X174)","v":0},{"$f":"'Cable Parameters'!U174","v":"TFT-401"}]
[null,{"$f":"'Cable Parameters'!AA175","v":19.05},{"$f":"'Cable Parameters'!W175","v":4.0599999999999996},{"$f":"'Cable Parameters'!Z175","v":"In/Out door"},{"$f":"'Cable Parameters'!Y175","v":"N/A"},{"$f":"IF(ISERROR('Cable Parameters'!X175),\"\",'Cable Parameters'!X175)","v":0},{"$f":"'Cable Parameters'!U175","v":"TFT-402"}]
[null,{"$f":"'Cable Parameters'!AA176","v":25},{"$f":"'Cable Parameters'!W176","v":4.95},{"$f":"'Cable Parameters'!Z176","v":"In/Out door"},{"$f":"'Cable Parameters'!Y176","v":"N/A"},{"$f":"IF(ISERROR('Cable Parameters'!X176),\"\",'Cable Parameters'!X176)","v":0},{"$f":"'Cable Parameters'!U176","v":"Silverline Standard"}]
[null,{"$f":"'Cable Parameters'!AA177","v":25},{"$f":"'Cable Parameters'!W177","v":4.95},{"$f":"'Cable Parameters'!Z177","v":"In/Out door"},{"$f":"'Cable Parameters'!Y177","v":"N/A"},{"$f":"IF(ISERROR('Cable Parameters'!X177),\"\",'Cable Parameters'!X177)","v":0},{"$f":"'Cable Parameters'!U177","v":"Silverline SF (Super Flex)"}]
[null,{"$f":"'Cable Parameters'!AA178","v":25},{"$f":"'Cable Parameters'!W178","v":4.95},{"$f":"'Cable Parameters'!Z178","v":"In/Out door"},{"$f":"'Cable Parameters'!Y178","v":"N/A"},{"$f":"IF(ISERROR('Cable Parameters'!X178),\"\",'Cable Parameters'!X178)","v":0},{"$f":"'Cable Parameters'!U178","v":"Silverline LL (Low Loss)"}]
[null,{"$f":"'Cable Parameters'!AA179","v":25},{"$f":"'Cable Parameters'!W179","v":4.95},{"$f":"'Cable Parameters'!Z179","v":"In/Out door"},{"$f":"'Cable Parameters'!Y179","v":"N/A"},{"$f":"IF(ISERROR('Cable Parameters'!X179),\"\",'Cable Parameters'!X179)","v":0},{"$f":"'Cable Parameters'!U179","v":"Silverline TT (TempTrack)"}]
[null,{"$f":"'Cable Parameters'!AA180","v":19},{"$f":"'Cable Parameters'!W180","v":3.8},{"$f":"'Cable Parameters'!Z180","v":"In/Out door"},{"$f":"'Cable Parameters'!Y180","v":"N/A"},{"$f":"IF(ISERROR('Cable Parameters'!X180),\"\",'Cable Parameters'!X180)","v":0},{"$f":"'Cable Parameters'!U180","v":"Silverline TT (Extra Flex)"}]
[null,{"$f":"'Cable Parameters'!AA181","v":25},{"$f":"'Cable Parameters'!W181","v":4.95},{"$f":"'Cable Parameters'!Z181","v":"In/Out door"},{"$f":"'Cable Parameters'!Y181","v":"N/A"},{"$f":"IF(ISERROR('Cable Parameters'!X181),\"\",'Cable Parameters'!X181)","v":0},{"$f":"'Cable Parameters'!U181","v":"Silverline 75 (75 Ohm)"}]
[null,{"$f":"'Cable Parameters'!AA182","v":63.5},{"$f":"'Cable Parameters'!W182","v":10.8},{"$f":"'Cable Parameters'!Z182","v":"Indoor Only"},{"$f":"'Cable Parameters'!Y182","v":"N/A"},{"$f":"IF(ISERROR('Cable Parameters'!X182),\"\",'Cable Parameters'!X182)","v":0},{"$f":"'Cable Parameters'!U182","v":"Silverline VNA"}]
[null,{"$f":"'Cable Parameters'!AA183","v":50},{"$f":"'Cable Parameters'!W183","v":5.5},{"$f":"'Cable Parameters'!Z183","v":"Indoor Only"},{"$f":"'Cable Parameters'!Y183","v":"N/A"},{"$f":"IF(ISERROR('Cable Parameters'!X183),\"\",'Cable Parameters'!X183)","v":0},{"$f":"'Cable Parameters'!U183","v":"Clarity™ Series"}]
[null,{"$f":"'Cable Parameters'!AA184","v":6.4},{"$f":"'Cable Parameters'!W184","v":2.79},{"$f":"'Cable Parameters'!Z184","v":"In/Out door"},{"$f":"'Cable Parameters'!Y184","v":"N/A"},{"$f":"IF(ISERROR('Cable Parameters'!X184),\"\",'Cable Parameters'!X184)","v":0},{"$f":"'Cable Parameters'!U184","v":"LMR100A"}]
[null,{"$f":"'Cable Parameters'!AA185","v":12.7},{"$f":"'Cable Parameters'!W185","v":4.95},{"$f":"'Cable Parameters'!Z185","v":"In/Out door"},{"$f":"'Cable Parameters'!Y185","v":"N/A"},{"$f":"IF(ISERROR('Cable Parameters'!X185),\"\",'Cable Parameters'!X185)","v":0},{"$f":"'Cable Parameters'!U185","v":"LMR195"}]
[null,{"$f":"'Cable Parameters'!AA186","v":12.7},{"$f":"'Cable Parameters'!W186","v":4.95},{"$f":"'Cable Parameters'!Z186","v":"In/Out door"},{"$f":"'Cable Parameters'!Y186","v":"N/A"},{"$f":"IF(ISERROR('Cable Parameters'!X186),\"\",'Cable Parameters'!X186)","v":0},{"$f":"'Cable Parameters'!U186","v":"LMR 200"}]
[null,{"$f":"'Cable Parameters'!AA187","v":19.100000000000001},{"$f":"'Cable Parameters'!W187","v":6.1},{"$f":"'Cable Parameters'!Z187","v":"In/Out door"},{"$f":"'Cable Parameters'!Y187","v":"N/A"},{"$f":"IF(ISERROR('Cable Parameters'!X187),\"\",'Cable Parameters'!X187)","v":0},{"$f":"'Cable Parameters'!U187","v":"LMR 240"}]
[null,{"$f":"'Cable Parameters'!AA188","v":22.2},{"$f":"'Cable Parameters'!W188","v":7.62},null,{"$f":"'Cable Parameters'!Y188","v":"N/A"},{"$f":"IF(ISERROR('Cable Parameters'!X188),\"\",'Cable Parameters'!X188)","v":0},{"$f":"'Cable Parameters'!U188","v":"LMR 300"}]
[null,{"$f":"'Cable Parameters'!AA189","v":12.45},{"$f":"'Cable Parameters'!W189","v":2.4900000000000002},null,{"$f":"'Cable Parameters'!Y189","v":"N/A"},{"$f":"IF(ISERROR('Cable Parameters'!X189),\"\",'Cable Parameters'!X189)","v":0},{"$f":"'Cable Parameters'!U189","v":"M17/113-RG316"}]
[null,{"$f":"'Cable Parameters'!AA190","v":13.95},{"$f":"'Cable Parameters'!W190","v":2.79},null,{"$f":"'Cable Parameters'!Y190","v":"N/A"},{"$f":"IF(ISERROR('Cable Parameters'!X190),\"\",'Cable Parameters'!X190)","v":0},{"$f":"'Cable Parameters'!U190","v":"M17/119-RG174"}]
[null,{"$f":"'Cable Parameters'!AA191","v":26.9},{"$f":"'Cable Parameters'!W191","v":5.38},null,{"$f":"'Cable Parameters'!Y191","v":"N/A"},{"$f":"IF(ISERROR('Cable Parameters'!X191),\"\",'Cable Parameters'!X191)","v":0},{"$f":"'Cable Parameters'!U191","v":"M17/84-RG223"}]

{"sheet":"APPLICATION","index":5,"n_rows":3,"n_cols":83,"rows_kept":3,"cut":false,"hidden":false,"merged":[]}
[null,null,null,null,null,null,null,null,null,null,null,null,null,null,null,null,0,null,null,null,null,0,null,null,null,null,null,null,null,null,1,null,null,null,null,null,null,null,null,null,null,null,null,null,null,null,null,null,null,null,null,null,null,null,null,null,null,null,null,null,null,null,null,null,null,null,null,null,null,null,null,null,null,null,null,null,null,null,null,null,null,null,"2019-02-01"]
[null,null,null,null,null,null,null,null,null,null,null,null,null,null,null,null,null,null,null,null,"רשימות",null,null,null,null,null,null,null,null,null,null,null,null,null,null,null,null,null,null,null,null,null,null,null,null,null,null,null,null,null,null,null,null,null,null,"00:00:09"]
[null,null,null,null,null,null,null,null,null,null,null,null,null,null,null,null,null,null,null,null,null,30]

{"sheet":"Input","index":6,"n_rows":22,"n_cols":81,"rows_kept":22,"cut":false,"hidden":true,"merged":[[12,7,14,8],[16,7,18,8],[20,7,22,8],[2,1,2,11],[15,10,17,11],[8,3,10,5],[12,3,14,5],[16,3,18,5],[20,3,22,5],[8,7,10,8],[3,7,5,8],[3,3,5,5]]}
[null,null,null,null,null,null,null,null,null,null,null,null,null,null,null,null,null,null,null,"save"]
[null,null,null,null,null,null,null,null,null,null,null,null,null,null,0,null,null,null,null,0,null,null,null,null,null,null,null,null,1,null,null,null,null,null,null,null,null,null,null,null,null,null,null,null,null,null,null,null,null,null,null,null,null,null,null,null,null,null,null,null,null,null,null,null,null,null,null,null,null,null,null,null,null,null,null,null,null,null,null,null,"2019-02-01"]
[null,null,null,null,null,null,null,null,null,null,null,null,null,null,null,null,null,null,"רשימות",null,null,null,null,null,null,null,null,null,null,null,null,null,null,null,null,null,null,null,null,null,null,null,null,null,null,null,null,null,null,null,null,null,null,"00:00:09"]
[null,null,null,"Application",null,null,null,null,null,null,null,null,null,null,null,null,null,null,null,30]
[null,null,null,null,null,null,null,null,null,null,null,null,null,null,null,null,null,null,"Indoor"]
[null,null,null,null,null,null,null,null,null,null,null,null,null,null,null,null,null,null,"Outdoor"]
[null,null,null,null,null,null,null,null,null,null,null,null,null,null,null,null,null,null,"All"]
[null,null,null,null,null,null,null,null,null,null,null,null,null,null,null,null,null,null,"לחצן ראשון"]
[null,null,null,"Indoor / Outdoor",null,null,null,null,null,null,null,null,null,null,null,null,null,null,{"$f":"AND($H$21=\"\",$H$13=\"\",$H$9=0)","v":true}]
[null,null,null,null,null,null,null,null,null,null,null,null,null,null,null,null,null,null,null,"flash"]
[null,null,null,null,null,null,null,null,null,null,null,null,null,null,null,null,null,null,"לחצן ראשון",1]
[null,null,null,null,null,null,null,null,null,null,null,null,null,null,null,null,null,null,{"$f":"#REF!=\"\"","v":{"$error":"#REF!"}}]
[null,null,null,"Max. Freq. Work\n",null,null,null,null,null,null,null,null,null,null,null,null,null,null,null,"flash"]
[null,null,null,null,null,null,null,null,null,"GHz",null,null,null,null,null,null,null,null,"cable name",0]
[null,null,null,null,null,null,null,null,null,null,null,null,null,null,null,null,null,null,{"$f":"LEFT(#REF!,1)","v":{"$error":"#REF!"}},1]
[null,null,null,null,null,null,null,null,null,null,null,null,null,null,null,null,null,null,{"$f":"IF(S15=\"*\",TRUE,FALSE)","v":{"$error":"#REF!"}}]
[null,null,null,"Max. CW Power\n",null,null,null,"N/A"]
[null,null,null,null,null,null,null,null,null,"w"]
[]
[]
[null,null,null,"Max. Thick.\n"]
[null,null,null,null,null,null,null,null,null,"mm","(±1 mm)"]

{"sheet":"Insertion Loss","index":7,"n_rows":96,"n_cols":81,"rows_kept":96,"cut":false,"hidden":false,"merged":[[11,0,12,0],[11,1,11,2],[2,15,4,16],[7,9,7,11],[8,9,8,11],[5,5,6,7],[5,9,6,11],[1,17,1,18],[3,9,3,10],[1,1,1,11],[4,5,4,7],[4,9,4,11],[2,2,2,10],[23,7,23,8],[24,7,24,8],[37,2,38,2],[37,9,37,10],[38,9,38,10],[38,7,38,8],[14,2,14,4],[8,2,8,3],[20,7,20,9],[21,7,21,8],[22,7,22,8],[12,1,12,2],[39,3,39,4],[25,7,25,8],[26,7,26,8],[27,7,27,8],[28,7,28,8],[38,3,38,4],[38,5,38,6],[37,3,37,8],[39,5,39,6],[41,5,41,6],[42,5,42,6],[43,5,43,6],[44,5,44,6],[50,5,50,6],[50,7,50,8],[59,4,59,6],[53,1,53,11],[51,5,51,6],[51,7,51,8],[51,3,51,4],[50,3,50,4],[55,1,55,11],[50,9,50,10],[51,9,51,10],[57,5,57,7],[49,3,49,4],[41,3,41,4],[42,3,42,4],[43,3,43,4],[44,3,44,4],[45,3,45,4],[48,3,48,4],[46,3,46,4],[47,3,47,4],[44,7,44,8],[39,7,39,8],[41,7,41,8],[42,7,42,8],[43,7,43,8],[44,9,44,10],[39,9,39,10],[41,9,41,10],[42,9,42,10],[43,9,43,10],[48,9,48,10],[49,9,49,10],[45,5,45,6],[46,5,46,6],[47,5,47,6],[48,5,48,6],[46,7,46,8],[47,7,47,8],[48,7,48,8],[49,7,49,8],[45,7,45,8],[45,9,45,10],[46,9,46,10],[47,9,47,10],[49,5,49,6]]}
[null,null,null,null,null,null,null,null,null,null,null,null,null,null,0,1,null,null,null,null,null,null,null,null,null,null,null,null,1,null,null,null,null,null,null,null,null,null,null,null,null,null,null,null,null,null,null,null,null,null,null,null,null,null,null,null,null,null,null,null,null,null,null,null,null,null,null,null,null,null,null,null,null,null,null,null,null,null,null,null,"2019-02-01"]
[null,{"$f":"\"\"&J16&\" Coaxial Cable Assembly\"","v":"EZ_118_TP Coaxial Cable Assembly"},null,null,null,null,null,null,null,null,null,null,null,null,null,null,null,null,null,null,null,null,null,null,null,null,null,null,null,null,null,null,null,null,null,null,null,null,null,null,null,null,null,null,null,null,null,null,null,null,null,null,null,"00:00:09"]
[null,null,"Enter Part No. Here",null,null,null,null,null,null,null,null,null,null,null,null,null,null,null,null,null,null,null,null,null,null,null,null,null,null,null,null,null,null,null,null,null,null,null,null,null,null,null,null,null,null,null,null,null,null,null,null,null,null,1]
[]
[null,"Length",1000,"mm",null,"Limits",null,null,null,"Diag. Options",null,null,null,null,null,null,null,1]
[null,"Freq.  Max",{"$f":"INDEX('Cable Parameters'!A:EI,$J$20,6)","v":40}," GHz",null," Select Parameters\n",null,null,null,{"$f":"HYPERLINK(INDEX('Cable Parameters'!A:K,J20,10),\"Download Data Sheet\")","v":"Download Data Sheet"},null,null,null,null,null,null,null,{"$f":"INDEX('Cable Parameters'!BV5:BV11,'Insertion Loss'!R5)","v":0}]
[null,"CW Power Max",{"$f":"INDEX('Cable Parameters'!A:EI,$J$20,4)","v":"N/A"},"w"]
[0,"Thick. Max",{"$f":"INDEX('Cable Parameters'!A:EI,$J$20,11)","v":3},"mm",{"$f":"CONCATENATE(\"(min: \",J27,\")\")","v":"(min: -55)"},"Temp. min",-55,"°C",null,1]
[null,"Cable","EZ_118_TP",null,{"$f":"CONCATENATE(\"(max: \",J28,\")\")","v":"(max: 200)"},"Temp. max",200,"°C",null,1]
[null,"Conn. |",{"$f":"D18","v":"None"},null,{"$f":"CONCATENATE(\"(min: \",0,\")\")","v":"(min: 0)"},"Freq. min",0,"GHz"]
[null,"Conn. ||",{"$f":"D19","v":"None"},null,{"$f":"CONCATENATE(\"(max: \",J26,\")\")","v":"(max: 40)"},"Freq. max",40,"GHz"]
[null,"Min. Bend Radius (mm)",null,{"$f":"INDEX('Cable Parameters'!A:EI,$J$20,124)","v":9.52},null,null,0,0]
[null,"Application",null,{"$f":"INDEX('Cable Parameters'!A:EI,$J$20,126)","v":"Indoor Only"}]
[null,null,1]
[null,null,"קישור בתאים כדי למנוע תכנות רב"]
[null,null,4,"INDEX CONN1",{"$f":"Index_Conn_I_Type+1","v":5},{"$f":"INDEX('Connector Types'!A:B,'Insertion Loss'!E16,2)","v":0},null,null,"CABLE",{"$f":"IF(ISERROR(J20),\"\",J19)","v":"EZ_118_TP"}]
[null,null,4,"INDEX CONN2",{"$f":"Index_Conn_II_Type+1","v":5},{"$f":"INDEX('Connector Types'!A:B,'Insertion Loss'!E17,2)","v":0},null,"INDEX CABLE"]
[null,null,null,{"$f":"INDEX('Connector Types'!A:B,'Insertion Loss'!E16,1)","v":"None"},null,null,null,null,"ROW"]
[null,null,null,{"$f":"INDEX('Connector Types'!A:B,'Insertion Loss'!E17,1)","v":"None"},null,null,null,"CABLE",null,{"$f":"C9","v":"EZ_118_TP"}]
[null,null,null,null,null,null,null,"מוצא שורה של כבל",null,{"$f":"VLOOKUP(C9,'Cable Parameters'!A:AC,12,FALSE)+5","v":6}]
[null,null,null,null,null,"מספר שורה",null,"נתוני כבל לנוסחה"]
[null,null,null,"FREQ",null,null,null,"coefficient A nominal",null,{"$f":"INDEX('Cable Parameters'!A:L,$J$20,2)","v":0.38040000000000002}]
[null,null,"index",6,null,null,null,"coefficient B  nominal",null,{"$f":"INDEX('Cable Parameters'!A:L,$J$20,3)","v":1.6000000000000001E-4}]
[null,null,{"$f":"D23+10","v":16},"מחזיר את מס העמודה",null,null,null,"coefficient A max",null,{"$f":"INDEX('Cable Parameters'!A:L,$J$20,4)","v":"N/A"}]
[null,null,null,null,null,null,null,"coefficient B  max",null,{"$f":"INDEX('Cable Parameters'!A:L,$J$20,5)","v":0}]
[null,null,null,null,null,null,null,"max freq",null,{"$f":"INDEX('Cable Parameters'!A:L,$J$20,6)","v":40}]
["`",null,null,"FREQ",null,null,"THICKNESS","min temp",null,{"$f":"INDEX('Cable Parameters'!A:L,$J$20,8)","v":-55}]
[null,null,"index",27,null,"index",60,"max temp",null,{"$f":"INDEX('Cable Parameters'!A:L,$J$20,7)","v":200}]
[null,null,{"$f":"D28+5","v":32},"היפרלינק",{"$f":"INDEX('Cable Parameters'!A:K,J20,10)","v":"https://www.ezform.com/product/ez-118-tp/"},{"$f":"G28+5","v":65},"מחזיר את מס השורה","Temp. coeff.",null,{"$f":"INDEX('Cable Parameters'!A:L,$J$20,9)","v":0.2}]
[null,null,{"$f":"INDEX('Cable Parameters'!O:O,'Insertion Loss'!C29,1)","v":32},"ערך תדר נבחר",null,{"$f":"INDEX('Cable Parameters'!V:V,'Insertion Loss'!F29,1)","v":52.3},"ערך עובי נבחר"]
[]
[]
[]
[null,null,null,{"$f":"\"Insertion Loss Calculation at \"&G9&\"°C\"","v":"Insertion Loss Calculation at 200°C"},null,null,null,null,null,{"$f":"\"CW Power\"","v":"CW Power"}]
[null,null,null,{"$f":"\"Insertion Loss Calculation at  25°C\"","v":"Insertion Loss Calculation at  25°C"}]
[null,null,null,{"$f":"\"Insertion Loss Calculation at \"&G8&\"°C\"","v":"Insertion Loss Calculation at -55°C"}]
[]
[null,null,"Freq.","Insertion Loss Calculation (all Values in dB)",null,null,null,null,null,"*CW Power "]
[null,null,null,{"$f":"25 & \" °C\"","v":"25 °C"},null,{"$f":"G8 & \" °C\"","v":"-55 °C"},null,{"$f":"G9 & \" °C\"","v":"200 °C"},null,"[W]"]
[null,null,"[GHz]","nom.",null,"nom.",null,"nom.",null,"max."]
[null,null,{"$f":"$G$10+($G$11-$G$10)/10","v":4},{"$f":"$G$10+($G$11-$G$10)/10","v":4},null,{"$f":"\"25°C nom.\"","v":"25°C nom."},null,null,{"$f":"TEXT($G$9,\"0°C\")&\" nom.\"","v":"200°C nom."},{"$f":"TEXT($G$9,\"0°C\")&\" max.\"","v":"200°C max."}]
[null,null,{"$f":"IF($G$10=0,0.01,$G$10)","v":0.01},{"$f":"IF($J$8,(($J$22*SQRT($C42*1000)+$J$23*$C42*1000))/30480*Length*(1+$J$29/100*(25-25))+($F$16+$F$17)*SQRT($C42),\"\")","v":3.9518714630185421E-2},null,{"$f":"IF($G$8<$J$27,\"\",IF($J$9,(($J$22*SQRT($C42*1000)+$J$23*$C42*1000))/30480*Length*(1+$J$29/100*($G$8-25))+($F$16+$F$17)*SQRT($C42),\"\"))","v":3.3195720289355753E-2},null,{"$f":"IF($G$9>$J$28,\"\",IF($J$9,(($J$22*SQRT($C42*1000)+$J$23*$C42*1000))/30480*Length*(1+$J$29/100*($G$9-25))+($F$16+$F$17)*SQRT($C42),\"\"))","v":5.3350264750750324E-2},null,"N/A"]
[null,null,{"$f":"$G$10+($G$11-$G$10)/10","v":4},0.81032179916538816,null,0.68067031129892608,null,1.0939344288732742,null,"N/A"]
[null,null,{"$f":"$G$10+($G$11-$G$10)*2/10","v":8},1.1582680559592129,null,0.97294516700573874,null,1.5636618755449374,null,"N/A"]
[null,null,{"$f":"$G$10+($G$11-$G$10)*3/10","v":12},1.4301421317254934,null,1.2013193906494144,null,1.9306918778294162,null,"N/A"]
[null,null,{"$f":"$G$10+($G$11-$G$10)*4/10","v":16},1.6626383489869443,null,1.3966162131490332,null,2.2445617711323749,null,"N/A"]
[null,null,{"$f":"$G$10+($G$11-$G$10)*5/10","v":20},1.8699699446414877,null,1.5707747534988497,null,2.5244594252660084,null,"N/A"]
[null,null,{"$f":"$G$10+($G$11-$G$10)*6/10","v":24},2.0594263318862227,null,1.729918118784427,null,2.7802255480464009,null,"N/A"]
[null,null,{"$f":"$G$10+($G$11-$G$10)*7/10","v":28},2.2353377565194381,null,1.877683715476328,null,3.0177059713012415,null,"N/A"]
[null,null,{"$f":"$G$10+($G$11-$G$10)*8/10","v":32},2.4005256132307613,null,2.0164415151138395,null,3.2407095778615278,null,"N/A"]
[null,null,{"$f":"$G$10+($G$11-$G$10)*9/10","v":36},2.5569496494646686,null,2.1478377055503217,null,3.4518820267773029,null,"N/A"]
[null,null,{"$f":"$G$11","v":40},2.7060367454068239,null,2.2730708661417318,null,3.6531496062992126,null,"N/A"]
[]
[null,"Remark: Based on actual results in the production department"]
[]
[null,"* The Power Handling calculation is based on operation under controlled conditions: 25°C, sea level, still air (natural convection) environment. Power handling may be limited by connector choice. If your application will operate at high power levels, contact a EIM First Application Engineering Representative for additional information."]
[]
[null,null,null,null,null,{"$f":"TODAY()","v":"2019-06-13"}]
[]
[null,null,null,null,"© EIM First LTD. ",null,null,{"$f":"HOME!I24","v":"REV.31 21/5/19"}]
[]
[]
[]
[]
[]
[]
[]
[]
[]
[]
[]
[]
[]
[]
[]
[]
[]
[]
[]
[]
[]
[]
[]
[]
[]
[]
[]
[]
[]
[6]
[18]
[1]
[17]
[]
[9]
[3]

{"sheet":"גיליון1","index":8,"n_rows":0,"n_cols":0,"rows_kept":0,"cut":false,"hidden":false,"merged":[]}

{"sheet":"HOME","index":9,"n_rows":26,"n_cols":9,"rows_kept":26,"cut":false,"hidden":false,"merged":[[30,11,30,13],[25,3,29,16],[30,9,30,10],[23,8,24,11]]}
[]
[]
[]
[]
[]
[]
[]
[]
[]
[null,null,null,null,null,null,0]
[]
[null,null,null,9.65,null,null,null,0]
[]
[]
[]
[null,null,4]
[null,null,4]
[]
[]
[]
[]
[]
[]
[null,null,null,null,null,null,null,null,"REV.31 21/5/19"]
[]
[null,null,null,"Drawing and Loss Calculator For RF Cables & Connectors"]

{"sheet":"Drawing table","index":10,"n_rows":24,"n_cols":66,"rows_kept":24,"cut":false,"hidden":false,"merged":[[0,41,0,47],[0,50,0,56],[0,4,0,10],[0,15,0,21],[0,23,0,29],[0,32,0,38]]}
[null,null,null,null,"TNC",null,null,null,null,null,null,null,null,null,null,"SMA",null,null,null,null,null,null,null,"BMA",null,null,null,null,null,null,null,null,"N",null,null,null,null,null,null,null,null,7.16,null,null,null,null,null,null,null,null,"SMP"]
["Picture 19",null,null,"Picture 2",null,null,null,null,11,null,null,null,"Picture 1","Picture 12",null,null,null,11,null,null,null,"Picture 11","Picture 24",null,null,null,13,null,null,null,"Picture 23","Picture 36",null,null,null,11,null,null,null,"Picture 35",null,null,null,null,null,null,null,null,null,null,null,null,null,null,null,null,null,null,null,null,null,null,null,null,null,"Picture 32"]
[null,null,null,null,null,null,null,null,null,null,null,null,null,null,null,null,null,null,null,null,null,null,null,null,null,null,null,null,null,null,null,null,null,null,null,null,null,null,null,null,"Picture 50",null,null,null,11,null,null,null,"Picture 45","Picture 60",null,null,null,"SMP",null,null,null,"Picture 59"]
[null,null,null,"Picture 4",null,null,null,null,16,null,null,null,null,"Picture 14",null,null,null,16,null,null,null,"Picture 13","Picture 26",null,null,null,14,null,null,null,"Picture 25","Picture 38",null,null,null,16]
[null,null,null,null,null,null,null,null,null,null,null,null,"Picture 3",null,null,null,null,null,null,null,null,null,null,null,null,null,null,null,null,null,null,null,null,null,null,null,null,null,null,"Picture 37","Picture 52",null,null,null,16,null,null,null,"Picture 51","Picture 48",null,null,null,null,null,null,null,"Picture 47"]
[]
[]
[]
[null,null,null,"Picture 6",null,null,null,null,null,null,null,null,"Picture 5","Picture 16",null,null,null,21,null,null,null,"Picture 15",null,null,null,null,null,null,null,null,null,null,null,null,null,null,null,null,null,null,null,null,null,null,null,null,null,null,null,null,null,null,"free drawing"]
[null,null,null,null,null,null,null,null,21,null,null,null,null,null,null,null,null,null,null,null,null,null,"Picture 28",null,null,null,15,null,null,null,"Picture 27","Picture 40",null,null,null,21,null,null,null,null,"Picture 54",null,null,null,21,null,null,null,"Picture 53",null,"Picture 69"]
[null,"תמונה 70",null,null,null,null,null,null,null,null,null,null,null,null,null,null,null,null,null,null,null,null,null,null,null,null,null,null,null,null,null,null,null,null,null,null,null,null,null,"Picture 39",null,null,null,null,null,null,null,null,null,null,null,null,null,null,null,null,null,"Picture 68"]
[]
[]
[]
[null,null,null,"Picture 8",null,null,null,null,null,null,null,null,"Picture 7","Picture 18",null,null,null,24,null,null,null,"Picture 17"]
[null,null,null,null,null,null,null,null,24,null,null,null,null,null,null,null,null,null,null,null,null,null,"Picture 30",null,null,null,24,null,null,null,"Picture 29",null,null,null,null,24,null,null,null,null,"Picture 56"]
[null,null,null,null,null,null,null,null,null,null,null,null,null,null,null,null,null,null,null,null,null,null,null,null,null,null,null,null,null,null,null,"Picture 42",null,null,null,null,null,null,null,"Picture 41",null,null,null,null,24,null,null,null,"Picture 55"]
[]
[]
[]
[]
[null,null,null,null,null,null,null,null,null,null,null,null,null,"Picture 21",null,null,null,null,null,null,null,"Picture 20",null,null,null,null,25,null,null,null,"Picture 31","Picture 44",null,null,null,25]
[null,null,null,"Picture 10",null,null,null,null,null,null,null,null,"Picture 9",null,null,null,null,25,null,null,null,null,"Picture 34",null,null,null,null,null,null,null,null,null,null,null,null,null,null,null,null,"Picture 43","Picture 58",null,null,null,25,null,null,null,"Picture 57"]
[null,null,null,null,null,null,null,null,25]

{"sheet":"SMP","index":11,"n_rows":33,"n_cols":23,"rows_kept":33,"cut":false,"hidden":false,"merged":[[31,7,36,8],[31,12,36,13],[33,6,34,6],[33,10,34,10],[33,14,34,14],[17,7,22,8],[17,12,22,13],[19,6,20,6],[19,10,20,10],[19,14,20,14],[24,7,29,8],[24,12,29,13],[26,6,27,6],[26,10,27,10],[26,14,27,14],[4,18,4,19],[4,20,4,21],[5,6,6,6],[5,10,6,10],[5,14,6,14],[10,7,15,8],[10,12,15,13],[12,6,13,6],[12,10,13,10],[12,14,13,14],[0,7,0,8],[0,9,0,11],[0,12,0,13],[1,9,2,11],[3,7,8,8],[3,12,8,13]]}
[null,null,null,null,null,null,null,"Conn. Right",null,"SMP",null,null,"Conn. Left"]
[null,null,null,null,null,null,null,null,null," Left & Right Connectors"]
[null,null,null,null,null,null,null,null,null,null,null,null,null,null,null,null,null,null,null,{"$f":"LEFT(T2,1)","v":""},"left",{"$f":"LEFT(V2,1)","v":""}]
[null,null,null,null,null,null,null,0,null,null,null,null,0]
[null,null,null,null,null,null,{"$f":"VLOOKUP('Insertion Loss'!$C$9,'Cable Parameters'!A:WQ,55,FALSE)","v":1},null,null,null,null,null,null,null,{"$f":"G5","v":1},null,null,null,"אחרון שדולק",null,"אחרון שדולק"]
[null,null,null,null,null,null,null,null,null,null,"SP SMP",null,null,null,null,null,null,null,"H",null,null,null,"M"]
[]
[null,null,null,null,null,null,null,null,null,null,null,null,null,null,null,null,null,null,"G",null,null,null,"O"]
[]
[]
[null,null,1,null,null,null,null,0,null,null,null,null,0]
[null,null,{"$f":"INDEX('Cable Parameters'!BV5:BV11,C11)","v":0},null,null,null,{"$f":"VLOOKUP('Insertion Loss'!$C$9,'Cable Parameters'!A:WQ,56,FALSE)","v":1},null,null,null,null,null,null,null,{"$f":"G12","v":1}]
[null,null,null,null,null,null,null,null,null,null,"RP SMP"]
[]
[]
[]
[]
[null,null,null,null,null,null,null,0,null,null,null,null,0]
[null,null,null,null,null,null,1,null,null,null,null,null,null,null,1]
[]
[]
[]
[]
[]
[]
[null,null,null,null,null,null,1,null,null,null,null,null,null,null,1]
[]
[]
[]
[]
[]
[null,null,null,null,null,null,null,null,null,null,null,null,0]
[null,null,null,null,null,null,1,null,null,null,null,null,null,null,1]

{"sheet":"716","index":12,"n_rows":34,"n_cols":23,"rows_kept":34,"cut":false,"hidden":false,"merged":[[31,7,36,8],[31,12,36,13],[33,6,34,6],[33,10,34,10],[33,14,34,14],[17,7,22,8],[17,12,22,13],[19,6,20,6],[19,10,20,10],[19,14,20,14],[24,7,29,8],[24,12,29,13],[26,6,27,6],[26,10,27,10],[26,14,27,14],[4,18,4,19],[4,20,4,21],[5,6,6,6],[5,10,6,10],[5,14,6,14],[10,7,15,8],[10,12,15,13],[12,6,13,6],[12,10,13,10],[12,14,13,14],[0,7,0,8],[0,9,0,11],[0,12,0,13],[1,9,2,11],[3,7,8,8],[3,12,8,13]]}
[null,null,null,null,null,null,null,"Conn. Right",null,"7/16",null,null,"Conn. Left"]
[null,null,null,null,null,null,null,null,null," Left & Right Connectors"]
[null,null,null,null,null,null,null,null,null,null,null,null,null,null,null,null,null,null,null,{"$f":"LEFT(T2,1)","v":""},"left",{"$f":"LEFT(V2,1)","v":""}]
[null,null,null,null,null,null,null,0,null,null,null,null,0]
[null,null,null,null,null,null,{"$f":"VLOOKUP('Insertion Loss'!$C$9,'Cable Parameters'!A:WQ,50,FALSE)","v":1},null,null,null,null,null,null,null,{"$f":"G5","v":1},null,null,null,"אחרון שדולק",null,"אחרון שדולק"]
[null,null,null,null,null,null,null,null,null,null,"SP 7/16",null,null,null,null,null,null,null,"H",null,null,null,"M"]
[]
[null,null,null,null,null,null,null,null,null,null,null,null,null,null,null,null,null,null,"G",null,null,null,"O"]
[]
[]
[null,null,3,null,null,null,null,0,null,null,null,null,0]
[null,null,{"$f":"INDEX('Cable Parameters'!BV5:BV11,C11)","v":"SMA"},null,null,null,{"$f":"VLOOKUP('Insertion Loss'!$C$9,'Cable Parameters'!A:WQ,51,FALSE)","v":1},null,null,null,null,null,null,null,{"$f":"G12","v":1}]
[null,null,null,null,null,null,null,null,null,null,"RP 7/16"]
[]
[]
[]
[]
[null,null,null,null,null,null,null,0,null,null,null,null,0]
[null,null,null,null,null,null,{"$f":"VLOOKUP('Insertion Loss'!$C$9,'Cable Parameters'!A:WQ,52,FALSE)","v":1},null,null,null,null,null,null,null,{"$f":"G19","v":1}]
[null,null,null,null,null,null,null,null,null,null,"SJ 7/16"]
[]
[]
[]
[]
[null,null,null,null,null,null,null,0,null,null,null,null,0]
[null,null,null,null,null,null,{"$f":"VLOOKUP('Insertion Loss'!$C$9,'Cable Parameters'!A:WQ,53,FALSE)","v":1},null,null,null,null,null,null,null,{"$f":"G26","v":1}]
[null,null,null,null,null,null,null,null,null,null,"BJ 7/16"]
[]
[]
[]
[]
[null,null,null,null,null,null,null,0,null,null,null,null,0]
[null,null,null,null,null,null,{"$f":"VLOOKUP('Insertion Loss'!$C$9,'Cable Parameters'!A:WQ,54,FALSE)","v":1},null,null,null,null,null,null,null,{"$f":"G33","v":1}]
[null,null,null,null,null,null,null,null,null,null,"FJ 7/16"]

{"sheet":"BMA","index":13,"n_rows":34,"n_cols":23,"rows_kept":34,"cut":false,"hidden":false,"merged":[[31,7,36,8],[31,12,36,13],[33,6,34,6],[33,10,34,10],[33,14,34,14],[17,7,22,8],[17,12,22,13],[19,6,20,6],[19,10,20,10],[19,14,20,14],[24,7,29,8],[24,12,29,13],[26,6,27,6],[26,10,27,10],[26,14,27,14],[4,18,4,19],[4,20,4,21],[5,6,6,6],[5,10,6,10],[5,14,6,14],[10,7,15,8],[10,12,15,13],[12,6,13,6],[12,10,13,10],[12,14,13,14],[0,7,0,8],[0,9,0,11],[0,12,0,13],[1,9,2,11],[3,7,8,8],[3,12,8,13]]}
[null,null,null,null,null,null,null,"Conn. Right",null,"BMA",null,null,"Conn. Left"]
[null,null,null,null,null,null,null,null,null," Left & Right Connectors"]
[null,null,null,null,null,null,null,null,null,null,null,null,null,null,null,null,null,null,null,{"$f":"LEFT(T2,1)","v":""},"left",{"$f":"LEFT(V2,1)","v":""}]
[null,null,null,null,null,null,null,0,null,null,null,null,0]
[null,null,null,null,null,null,{"$f":"VLOOKUP('Insertion Loss'!$C$9,'Cable Parameters'!A:WQ,45,FALSE)","v":1},null,null,null,null,null,null,null,{"$f":"G5","v":1},null,null,null,"אחרון שדולק",null,"אחרון שדולק"]
[null,null,null,null,null,null,null,null,null,null,"FJ BMA",null,null,null,null,null,null,null,"H",null,null,null,"M"]
[]
[null,null,null,null,null,null,null,null,null,null,null,null,null,null,null,null,null,null,"G",null,null,null,"O"]
[]
[]
[null,null,1,null,null,null,null,0,null,null,null,null,0]
[null,null,{"$f":"INDEX('Cable Parameters'!BV5:BV11,C11)","v":0},null,null,null,{"$f":"VLOOKUP('Insertion Loss'!$C$9,'Cable Parameters'!A:WQ,46,FALSE)","v":1},null,null,null,null,null,null,null,{"$f":"G12","v":1}]
[null,null,null,null,null,null,null,null,null,null,"BJ BMA"]
[]
[]
[]
[]
[null,null,null,null,null,null,null,0,null,null,null,null,0]
[null,null,null,null,null,null,{"$f":"VLOOKUP('Insertion Loss'!$C$9,'Cable Parameters'!A:WQ,47,FALSE)","v":1},null,null,null,null,null,null,null,{"$f":"G19","v":1}]
[null,null,null,null,null,null,null,null,null,null,"FJ BMA"]
[]
[]
[]
[]
[null,null,null,null,null,null,null,0,null,null,null,null,0]
[null,null,null,null,null,null,{"$f":"VLOOKUP('Insertion Loss'!$C$9,'Cable Parameters'!A:WQ,48,FALSE)","v":1},null,null,null,null,null,null,null,{"$f":"G26","v":1}]
[null,null,null,null,null,null,null,null,null,null,"SJ BMA"]
[]
[]
[]
[]
[null,null,null,null,null,null,null,0,null,null,null,null,0]
[null,null,null,null,null,null,{"$f":"VLOOKUP('Insertion Loss'!$C$9,'Cable Parameters'!A:WQ,49,FALSE)","v":1},null,null,null,null,null,null,null,{"$f":"G33","v":1}]
[null,null,null,null,null,null,null,null,null,null,"FJ BMA"]

{"sheet":"N","index":14,"n_rows":34,"n_cols":23,"rows_kept":34,"cut":false,"hidden":false,"merged":[[31,7,36,8],[31,12,36,13],[33,6,34,6],[33,10,34,10],[33,14,34,14],[17,7,22,8],[17,12,22,13],[19,6,20,6],[19,10,20,10],[19,14,20,14],[24,7,29,8],[24,12,29,13],[26,6,27,6],[26,10,27,10],[26,14,27,14],[4,18,4,19],[4,20,4,21],[5,6,6,6],[5,10,6,10],[5,14,6,14],[10,7,15,8],[10,12,15,13],[12,6,13,6],[12,10,13,10],[12,14,13,14],[0,7,0,8],[0,9,0,11],[0,12,0,13],[1,9,2,11],[3,7,8,8],[3,12,8,13]]}
[null,null,null,null,null,null,null,"Conn. Right",null,"N",null,null,"Conn. Left"]
[null,null,null,null,null,null,null,null,null," Left & Right Connectors"]
[null,null,null,null,null,null,null,null,null,null,null,null,null,null,null,null,null,null,null,{"$f":"LEFT(T2,1)","v":""},"left",{"$f":"LEFT(V2,1)","v":""}]
[null,null,null,null,null,null,null,0,null,null,null,null,0]
[null,null,null,null,null,null,{"$f":"VLOOKUP('Insertion Loss'!$C$9,'Cable Parameters'!A:WQ,40,FALSE)","v":1},null,null,null,null,null,null,null,{"$f":"G5","v":1},null,null,null,"אחרון שדולק",null,"אחרון שדולק"]
[null,null,null,null,null,null,null,null,null,null,"SP N",null,null,null,null,null,null,null,"H",null,null,null,"M"]
[]
[null,null,null,null,null,null,null,null,null,null,null,null,null,null,null,null,null,null,"G",null,null,null,"O"]
[]
[]
[null,null,1,null,null,null,null,0,null,null,null,null,0]
[null,null,{"$f":"INDEX('Cable Parameters'!BV5:BV11,C11)","v":0},null,null,null,{"$f":"VLOOKUP('Insertion Loss'!$C$9,'Cable Parameters'!A:WQ,41,FALSE)","v":1},null,null,null,null,null,null,null,{"$f":"G12","v":1}]
[null,null,null,null,null,null,null,null,null,null,"RP N"]
[]
[]
[]
[]
[null,null,null,null,null,null,null,0,null,null,null,null,0]
[null,null,null,null,null,null,{"$f":"VLOOKUP('Insertion Loss'!$C$9,'Cable Parameters'!A:WQ,42,FALSE)","v":1},null,null,null,null,null,null,null,{"$f":"G19","v":1}]
[null,null,null,null,null,null,null,null,null,null,"SJ N"]
[]
[]
[]
[]
[null,null,null,null,null,null,null,0,null,null,null,null,0]
[null,null,null,null,null,null,{"$f":"VLOOKUP('Insertion Loss'!$C$9,'Cable Parameters'!A:WQ,43,FALSE)","v":1},null,null,null,null,null,null,null,{"$f":"G26","v":1}]
[null,null,null,null,null,null,null,null,null,null,"BJ N"]
[]
[]
[]
[]
[null,null,null,null,null,null,null,0,null,null,null,null,0]
[null,null,null,null,null,null,{"$f":"VLOOKUP('Insertion Loss'!$C$9,'Cable Parameters'!A:WQ,44,FALSE)","v":1},null,null,null,null,null,null,null,{"$f":"G33","v":1}]
[null,null,null,null,null,null,null,null,null,null,"FJ N"]

{"sheet":"SMA","index":15,"n_rows":34,"n_cols":23,"rows_kept":34,"cut":false,"hidden":false,"merged":[[31,7,36,8],[31,12,36,13],[33,6,34,6],[33,10,34,10],[33,14,34,14],[17,7,22,8],[17,12,22,13],[19,6,20,6],[19,10,20,10],[19,14,20,14],[24,7,29,8],[24,12,29,13],[26,6,27,6],[26,10,27,10],[26,14,27,14],[4,18,4,19],[4,20,4,21],[5,6,6,6],[5,10,6,10],[5,14,6,14],[10,7,15,8],[10,12,15,13],[12,6,13,6],[12,10,13,10],[12,14,13,14],[0,7,0,8],[0,9,0,11],[0,12,0,13],[1,9,2,11],[3,7,8,8],[3,12,8,13]]}
[null,null,null,null,null,null,null,"Conn. Right",null,"SMA",null,null,"Conn. Left"]
[null,null,null,null,null,null,null,null,null," Left & Right Connectors"]
[null,null,null,null,null,null,null,null,null,null,null,null,null,null,null,null,null,null,null,{"$f":"LEFT(T2,1)","v":""},"left",{"$f":"LEFT(V2,1)","v":""}]
[null,null,null,null,null,null,null,0,null,null,null,null,0]
[null,null,null,null,null,null,{"$f":"VLOOKUP('Insertion Loss'!$C$9,'Cable Parameters'!A:WQ,35,FALSE)","v":1},null,null,null,null,null,null,null,{"$f":"G5","v":1},null,null,null,"אחרון שדולק",null,"אחרון שדולק"]
[null,null,null,null,null,null,null,null,null,null,"SP SMA",null,null,null,null,null,null,null,"H",null,null,null,"M"]
[]
[null,null,null,null,null,null,null,null,null,null,null,null,null,null,null,null,null,null,"G",null,null,null,"O"]
[]
[]
[null,null,1,null,null,null,null,0,null,null,null,null,0]
[null,null,{"$f":"INDEX('Cable Parameters'!BV5:BV11,C11)","v":0},null,null,null,{"$f":"VLOOKUP('Insertion Loss'!$C$9,'Cable Parameters'!A:WQ,36,FALSE)","v":1},null,null,null,null,null,null,null,{"$f":"G12","v":1}]
[null,null,null,null,null,null,null,null,null,null,"RP SMA"]
[]
[]
[]
[]
[null,null,null,null,null,null,null,0,null,null,null,null,0]
[null,null,null,null,null,null,{"$f":"VLOOKUP('Insertion Loss'!$C$9,'Cable Parameters'!A:WQ,37,FALSE)","v":1},null,null,null,null,null,null,null,{"$f":"G19","v":1}]
[null,null,null,null,null,null,null,null,null,null,"SJ SMA"]
[]
[]
[]
[]
[null,null,null,null,null,null,null,0,null,null,null,null,0]
[null,null,null,null,null,null,{"$f":"VLOOKUP('Insertion Loss'!$C$9,'Cable Parameters'!A:WQ,38,FALSE)","v":1},null,null,null,null,null,null,null,{"$f":"G26","v":1}]
[null,null,null,null,null,null,null,null,null,null,"BJ SMA"]
[]
[]
[]
[]
[null,null,null,null,null,null,null,0,null,null,null,null,0]
[null,null,null,null,null,null,{"$f":"VLOOKUP('Insertion Loss'!$C$9,'Cable Parameters'!A:WQ,39,FALSE)","v":1},null,null,null,null,null,null,null,{"$f":"G33","v":1}]
[null,null,null,null,null,null,null,null,null,null,"FJ SMA"]

{"sheet":"TNC","index":16,"n_rows":34,"n_cols":23,"rows_kept":34,"cut":false,"hidden":false,"merged":[[31,7,36,8],[31,12,36,13],[33,6,34,6],[33,10,34,10],[33,14,34,14],[0,9,0,11],[17,7,22,8],[17,12,22,13],[19,6,20,6],[19,10,20,10],[0,7,0,8],[0,12,0,13],[1,9,2,11],[19,14,20,14],[24,7,29,8],[24,12,29,13],[26,6,27,6],[26,10,27,10],[26,14,27,14],[4,20,4,21],[5,6,6,6],[5,10,6,10],[5,14,6,14],[10,7,15,8],[10,12,15,13],[12,6,13,6],[12,10,13,10],[12,14,13,14],[3,7,8,8],[3,12,8,13],[4,18,4,19]]}
[null,null,null,null,null,null,null,"Conn. Right",null,"TNC",null,null,"Conn. Left"]
[null,null,null,null,null,null,null,null,null," Left & Right Connectors"]
[null,null,null,null,null,null,null,null,null,null,null,null,null,null,null,null,null,null,null,{"$f":"LEFT(T2,1)","v":""},"left",{"$f":"LEFT(V2,1)","v":""}]
[null,null,null,null,null,null,null,0,null,null,null,null,0]
[null,null,null,null,null,null,{"$f":"VLOOKUP('Insertion Loss'!$C$9,'Cable Parameters'!A:WQ,30,FALSE)","v":1},null,null,null,null,null,null,null,{"$f":"G5","v":1},null,null,null,"אחרון שדולק",null,"אחרון שדולק"]
[null,null,null,null,null,null,null,null,null,null,"SP TNC",null,null,null,null,null,null,null,"H",null,null,null,"M"]
[]
[null,null,null,null,null,null,null,null,null,null,null,null,null,null,null,null,null,null,"G",null,null,null,"O"]
[]
[]
[null,null,1,null,null,null,null,0,null,null,null,null,0]
[null,null,{"$f":"INDEX('Cable Parameters'!BV5:BV11,C11)","v":0},null,null,null,{"$f":"VLOOKUP('Insertion Loss'!$C$9,'Cable Parameters'!A:WQ,31,FALSE)","v":1},null,null,null,null,null,null,null,{"$f":"G12","v":1}]
[null,null,null,null,null,null,null,null,null,null,"RP TNC"]
[]
[]
[]
[]
[null,null,null,null,null,null,null,0,null,null,null,null,0]
[null,null,null,null,null,null,{"$f":"VLOOKUP('Insertion Loss'!$C$9,'Cable Parameters'!A:WQ,32,FALSE)","v":1},null,null,null,null,null,null,null,{"$f":"G19","v":1}]
[null,null,null,null,null,null,null,null,null,null,"SJ TNC"]
[]
[]
[]
[]
[null,null,null,null,null,null,null,0,null,null,null,null,0]
[null,null,null,null,null,null,{"$f":"VLOOKUP('Insertion Loss'!$C$9,'Cable Parameters'!A:WQ,33,FALSE)","v":1},null,null,null,null,null,null,null,{"$f":"G26","v":1}]
[null,null,null,null,null,null,null,null,null,null,"BJ TNC"]
[]
[]
[]
[]
[null,null,null,null,null,null,null,0,null,null,null,null,0]
[null,null,null,null,null,null,{"$f":"VLOOKUP('Insertion Loss'!$C$9,'Cable Parameters'!A:WQ,34,FALSE)","v":1},null,null,null,null,null,null,null,{"$f":"G33","v":1}]
[null,null,null,null,null,null,null,null,null,null,"FJ TNC"]

{"sheet":"Support Sheet","index":17,"n_rows":34,"n_cols":12,"rows_kept":34,"cut":false,"hidden":true,"merged":[[7,1,7,2],[7,3,7,4],[7,5,7,6],[34,9,34,12],[35,9,35,12]]}
[]
[]
[]
[]
[]
[]
[]
[]
[]
[]
[]
[]
[]
[]
[]
[]
[null,null,null,null,null,null,null,null,null,null,null,"** גופן לבן"]
[]
[]
[]
[]
[]
[]
[]
[]
[]
[]
[]
[]
[]
[]
[]
[]
[null,null,null,null,null,null,null,null,null,"Formula"]

{"sheet":"Connector Types","index":18,"n_rows":10,"n_cols":2,"rows_kept":10,"cut":false,"hidden":true,"merged":[]}
["Connector Type","Connector attenuation\ncoefficient"]
["Straight",0.05]
["90° Box",7.4999999999999997E-2]
["90° Elbow",0.06]
["None",0]
[]
[]
[]
["Extension Swept [mm]"]
[30]

{"sheet":"History","index":19,"n_rows":32,"n_cols":5,"rows_kept":32,"cut":false,"hidden":true,"merged":[]}
["Revision of","Changes","Changed by","Date","סטטוס"]
[1,"Initial Version MG300 Calculator","L.Y","2016-11-20"]
[2,null,"ran saad","2018-08-23"]
[3,null,"ran saad","2018-08-28"]
[4,null,"ran saad","2018-09-02"]
[5,null,"ran saad","2018-09-05"]
[6,"PDF BUTTON","ran saad","2018-10-22"]
[7,"PDF+ DATASHEET","ran saad","2018-10-24"]
[8,"Drawing","ran saad","2018-11-01"]
[9,"Cable Search Typing","ran saad","2018-11-26","באתר"]
[10,"New connectors code because of  bug","ran saad","2018-11-27"]
[11,"Advertisements","ran saad","2018-11-29"]
[11,"FREQ. THICK.","ran saad","2018-12-03"]
[11,"Single Freq.","ran saad","2018-12-03"]
[12,"Free Drawing","ran saad","2018-12-04"]
[12,"Ex. Date","ran saad","2018-12-04"]
[13,"Mail XXX","ran saad","2018-12-14"]
[14,"Cable Filter & more…","ran saad","2018-12-19"]
[15,"Mail","ran saad","2018-12-20"]
[16,"Power Handling (Not complete)","ran saad","2018-12-25"]
[17,"In/Out door, Lables, ","ran saad","2018-12-30","באתר"]
[18,"Bend Radius","ran saad","2018-12-31","באתר"]
[19,"changing cable paramters in drawing mode & more…","ran saad","2019-01-02"]
[20,null,"ran saad"]
[21,"changing cable paramters in drawing mode & more…","ran saad","2019-01-07"]
[22,"more changes","ran saad","2019-01-07","באתר"]
[23,"Power Handling (Not complete)","ran saad",null,"באתר"]
[24,"last filter by insertion loss from smallest to larger + new cables","ran saad","2019-02-05","באתר"]
[25,"selection guide + new cables","ran saad","2019-02-06","באתר"]
[26,"select freq. or max. freq in insertion loss","ran saad","2019-02-07","באתר"]
[27,"adding LMR cables 100,195,240, RG316,174,223,58","ran saad","2019-02-14","באתר"]
[30,"הוספת מקום לטקסט בציור + הערות","ran saad","2019-04-17","באתר"]